program: Orca
programVersion: 5.0.2
elementType: Cl Cl O O O C C C C C C C C C C C C C C C C C C C C C H H H H H H H H H H H H H H H H H H H H
charge: 0
multiplicity: 1
keywords: wb97x-d3
keywords: def2-TZVPP
keywords: def2/J RIJCOSX
keywords: DEFGRID2
keywords: scfconv7
keywords: smallprint printgap noloewdin
keywords: NOSOSCF
formula: C21H20Cl2O3
InChI: InChI=1/C21H20Cl2O3/c1-21(2)17(12-18(22)23)19(21)20(24)25-13-14-7-6-10-16(11-14)26-15-8-4-3-5-9-15/h3-12,17,19H,13H2,1-2H3
46 atoms
Cl -3.756675 -1.122764 1.034765
Cl -3.424602 -1.600773 -1.787403
O  1.400596 2.619035 0.130724
O  0.138008 1.915769 -1.580252
O  3.002876 -2.082208 1.042992
C  -2.175602 2.984728 0.295237
C  -2.10721 1.498687 0.501381
C  -0.836257 2.337244 0.57766
C  -2.750505 3.794536 1.432324
C  -2.496102 3.562786 -1.059923
C  -2.382322 0.551541 -0.585496
C  0.242854 2.253512 -0.426563
C  -3.086225 -0.565991 -0.450303
C  2.604109 2.547677 -0.624466
C  3.386664 1.30051 -0.312134
C  2.7858 0.176208 0.236438
C  4.749468 1.280769 -0.598653
C  3.543467 -0.964919 0.474248
C  5.496364 0.142492 -0.341044
C  4.900226 -0.991314 0.191356
C  1.71001 -2.436047 0.760402
C  1.223641 -2.454724 -0.541509
C  0.909823 -2.833044 1.821355
C  -0.079595 -2.869405 -0.771137
C  -0.388412 -3.258442 1.574752
C  -0.890395 -3.273647 0.28159
H  -2.429128 1.164701 1.480603
H  -0.469014 2.482072 1.586736
H  -2.510453 3.362851 2.404558
H  -2.36373 4.815451 1.41583
H  -3.837774 3.849045 1.35222
H  -2.107885 2.991379 -1.898301
H  -3.578879 3.62814 -1.181424
H  -2.096997 4.575356 -1.140696
H  -2.020616 0.772528 -1.580306
H  2.401153 2.611596 -1.694933
H  3.182615 3.429706 -0.35041
H  1.734551 0.172601 0.493162
H  5.227928 2.158256 -1.017087
H  6.556251 0.13302 -0.560244
H  5.480121 -1.883757 0.389979
H  1.850343 -2.152547 -1.371431
H  1.302575 -2.812777 2.830431
H  -0.458346 -2.881136 -1.784722
H  -1.011239 -3.570615 2.403164
H  -1.903838 -3.601637 0.094224
elementType: Cl O C H
totalener: -1958.44697584 hartree
nucrepener: 2642.52152198 hartree
electener: -4600.96849782 hartree
oneelecener: -7939.14962456 hartree
twoeener: 3338.18112674 hartree
cpcmener: -0.02289979 hartree
kineticenergy: 1952.56227438 hartree
xcener: -143.512040777867 hartree
chargesum: 0.0000000
charge: -0.060434 -0.064649 -0.285600 -0.459363 -0.329998 0.084646 0.053810 -0.098991 -0.252997 -0.270491 -0.226178 0.393092 0.044304 0.085030 0.037135 -0.198487 -0.242758 0.258371 -0.111367 -0.249503 0.267331 -0.183513 -0.233308 -0.147671 -0.133458 -0.160278 0.090991 0.102304 0.089246 0.094985 0.096310 0.095238 0.101271 0.101557 0.134378 0.113554 0.123747 0.148703 0.139920 0.156490 0.144799 0.154658 0.144867 0.149869 0.154805 0.147634
qa: -0.0604 -0.0646 -0.2856 -0.4594 -0.3300 0.0846 0.0538 -0.0990 -0.2530 -0.2705 -0.2262 0.3931 0.0443 0.0850 0.0371 -0.1985 -0.2428 0.2584 -0.1114 -0.2495 0.2673 -0.1835 -0.2333 -0.1477 -0.1335 -0.1603 0.0910 0.1023 0.0892 0.0950 0.0963 0.0952 0.1013 0.1016 0.1344 0.1136 0.1237 0.1487 0.1399 0.1565 0.1448 0.1547 0.1449 0.1499 0.1548 0.1476
va: 1.2647 1.2408 2.1262 2.0344 2.0773 3.7891 3.7877 3.8759 3.9033 3.9044 3.8756 4.1436 4.2196 3.8484 3.6573 3.9097 3.9798 3.7718 3.8959 4.0045 3.7029 3.9289 4.0124 3.8439 3.9160 3.8277 1.0279 1.0278 1.0054 1.0022 1.0019 1.0148 1.0002 0.9998 1.0332 1.0141 0.9923 0.9983 1.0022 0.9889 1.0073 0.9975 1.0073 1.0026 0.9930 1.0103
dispcorr: -0.026219963 hartree
energy: -1958.473195806419
dipole: 12.73883 -12.50778 0.23105 21.93140 -20.22943 1.70196 2.84424 -2.30094 0.54329
magnitude: 1.80145 au
magnitude: 4.57892 debye
