program: Orca
programVersion: 5.0.2
elementType: Cl Cl O O O C C C C C C C C C C C C C C C C C C C C C H H H H H H H H H H H H H H H H H H H H
charge: 0
multiplicity: 1
keywords: wb97x-d3
keywords: def2-TZVPP
keywords: def2/J RIJCOSX
keywords: DEFGRID2
keywords: scfconv7
keywords: smallprint printgap noloewdin
keywords: NOSOSCF
formula: C21H20Cl2O3
InChI: InChI=1/C21H20Cl2O3/c1-21(2)17(12-18(22)23)19(21)20(24)25-13-14-7-6-10-16(11-14)26-15-8-4-3-5-9-15/h3-12,17,19H,13H2,1-2H3
46 atoms
Cl -1.597317 -0.238405 -1.080631
Cl -1.229369 0.924392 -3.698467
O  0.201397 1.831609 1.528546
O  0.127127 3.077462 -0.326756
O  1.081754 -3.260533 0.216035
C  -2.784341 3.740568 0.425398
C  -2.847586 2.429614 -0.281511
C  -1.881739 2.617256 0.886714
C  -3.926683 4.062434 1.361398
C  -2.235494 4.962512 -0.270053
C  -2.343147 2.257829 -1.66044
C  -0.4302 2.564946 0.607455
C  -1.806055 1.126621 -2.094195
C  1.567783 1.497834 1.264813
C  1.654888 0.357822 0.28985
C  1.380592 -0.931413 0.730002
C  1.938562 0.579025 -1.052757
C  1.401421 -1.989511 -0.166684
C  1.948388 -0.4836 -1.942648
C  1.689123 -1.772183 -1.505486
C  1.644885 -3.803699 1.330972
C  2.939398 -3.508275 1.742281
C  0.879993 -4.726208 2.032756
C  3.456853 -4.140033 2.863091
C  1.414299 -5.35544 3.145359
C  2.701804 -5.062843 3.571001
H  -3.691336 1.789943 -0.03633
H  -2.172429 2.123681 1.80634
H  -3.604778 4.750142 2.144948
H  -4.74572 4.536262 0.817479
H  -4.325604 3.170342 1.846141
H  -1.428929 4.746354 -0.96326
H  -3.038112 5.458614 -0.819802
H  -1.854034 5.674362 0.463576
H  -2.415981 3.082766 -2.357661
H  2.11865 2.368352 0.905937
H  1.974272 1.211746 2.234563
H  1.141889 -1.109798 1.772272
H  2.127881 1.5835 -1.404668
H  2.159698 -0.307748 -2.988729
H  1.695431 -2.607232 -2.193471
H  3.543636 -2.79842 1.192604
H  -0.12466 -4.947994 1.697405
H  4.465904 -3.91001 3.179217
H  0.814336 -6.075186 3.686463
H  3.113735 -5.551739 4.44326
totalener: -1958.42094938 hartree
nucrepener: 2648.61485479 hartree
electener: -4607.03580417 hartree
oneelecener: -7951.21285069 hartree
twoeener: 3344.17704652 hartree
kineticenergy: 1952.64958517 hartree
xcener: -143.522295504369 hartree
chargesum: 0.0000000
charge: -0.039479 -0.053049 -0.259893 -0.389287 -0.300105 0.109788 -0.056040 -0.085432 -0.238176 -0.275093 -0.172237 0.339107 0.093029 0.054891 -0.004931 -0.186156 -0.111113 0.194281 -0.138626 -0.157674 0.253176 -0.160949 -0.217544 -0.121378 -0.088001 -0.149858 0.101719 0.082186 0.091839 0.088937 0.073170 0.107714 0.088364 0.086989 0.109695 0.107969 0.107580 0.117232 0.122326 0.122999 0.124694 0.129842 0.124174 0.125620 0.123963 0.123736
qa: -0.0395 -0.0530 -0.2599 -0.3893 -0.3001 0.1098 -0.0560 -0.0854 -0.2382 -0.2751 -0.1722 0.3391 0.0930 0.0549 -0.0049 -0.1862 -0.1111 0.1943 -0.1386 -0.1577 0.2532 -0.1609 -0.2175 -0.1214 -0.0880 -0.1499 0.1017 0.0822 0.0918 0.0889 0.0732 0.1077 0.0884 0.0870 0.1097 0.1080 0.1076 0.1172 0.1223 0.1230 0.1247 0.1298 0.1242 0.1256 0.1240 0.1237
va: 1.3066 1.2550 2.1285 2.0859 2.1035 3.7330 3.8994 3.8602 3.9051 3.8987 3.9128 4.1645 4.1867 3.8667 3.6410 3.9437 3.8871 3.8288 3.9425 4.0024 3.8118 3.9223 4.0330 3.9529 3.9354 3.9636 1.0086 1.0347 1.0046 1.0047 1.0071 1.0191 0.9977 1.0050 1.0183 1.0110 0.9944 1.0160 1.0232 1.0053 1.0108 1.0070 1.0149 1.0001 0.9988 1.0008
dispcorr: -0.026937074 hartree
energy: -1958.447886458610
dipole: 0.05820 -0.32656 -0.26835 11.59960 -11.17930 0.42030 20.73288 -19.93601 0.79688
magnitude: 0.94004 au
magnitude: 2.38940 debye
