program: Orca
programVersion: 5.0.2
elementType: Cl Cl O O O C C C C C C C C C C C C C C C C C C C C C H H H H H H H H H H H H H H H H H H H H
charge: 0
multiplicity: 1
keywords: wb97x-d3
keywords: def2-TZVPP
keywords: def2/J RIJCOSX
keywords: DEFGRID2
keywords: scfconv7
keywords: smallprint printgap noloewdin
keywords: NOSOSCF
formula: C21H20Cl2O3
InChI: InChI=1/C21H20Cl2O3/c1-21(2)17(12-18(22)23)19(21)20(24)25-13-14-7-6-10-16(11-14)26-15-8-4-3-5-9-15/h3-12,17,19H,13H2,1-2H3
46 atoms
Cl -1.357569 -0.206919 -1.329089
Cl -0.843651 1.174777 -3.81056
O  0.040198 1.742595 1.621388
O  0.079507 3.076451 -0.174081
O  1.279186 -3.187518 0.008364
C  -2.922884 3.565952 0.349841
C  -2.851782 2.314984 -0.458325
C  -2.009479 2.449361 0.807838
C  -4.160589 3.761223 1.1947
C  -2.375104 4.86228 -0.194782
C  -2.217046 2.277955 -1.793259
C  -0.537219 2.487395 0.673638
C  -1.56851 1.218517 -2.255191
C  1.441443 1.489625 1.482549
C  1.691287 0.432982 0.443115
C  1.412839 -0.895116 0.746655
C  2.133242 0.770234 -0.829704
C  1.589192 -1.878033 -0.21683
C  2.297689 -0.218206 -1.788153
C  2.035628 -1.543541 -1.487245
C  1.5582 -3.767183 1.209781
C  0.626849 -4.6666 1.709601
C  2.744432 -3.530536 1.894645
C  0.886606 -5.334695 2.895733
C  2.986726 -4.199669 3.08419
C  2.063164 -5.101889 3.591804
H  -3.681237 1.621823 -0.344193
H  -2.35891 1.871711 1.655183
H  -4.556104 2.816163 1.569056
H  -3.946202 4.39534 2.056475
H  -4.949565 4.242982 0.614581
H  -1.494704 4.737657 -0.81748
H  -3.145401 5.362904 -0.78497
H  -2.105003 5.531934 0.623194
H  -2.285717 3.146766 -2.43552
H  1.981777 2.408622 1.250022
H  1.758023 1.148553 2.467975
H  1.049679 -1.158484 1.733342
H  2.325963 1.804882 -1.076663
H  2.632588 0.046075 -2.78211
H  2.1606 -2.319677 -2.230638
H  -0.290508 -4.841045 1.162905
H  3.476324 -2.836989 1.500953
H  0.158174 -6.036625 3.279791
H  3.912432 -4.017393 3.614077
H  2.261288 -5.621605 4.519284
totalener: -1958.42103099 hartree
nucrepener: 2653.51370607 hartree
electener: -4611.93473706 hartree
oneelecener: -7961.05963680 hartree
twoeener: 3349.12489974 hartree
kineticenergy: 1952.64608672 hartree
xcener: -143.521665901921 hartree
chargesum: -0.0000000
charge: -0.040047 -0.053103 -0.261040 -0.387759 -0.299763 0.109222 -0.055946 -0.084653 -0.237964 -0.276720 -0.172031 0.337071 0.094115 0.057235 -0.003264 -0.198171 -0.115561 0.211636 -0.129527 -0.170414 0.252861 -0.215130 -0.165579 -0.089808 -0.116164 -0.147597 0.102035 0.081943 0.072816 0.092029 0.089085 0.108734 0.088630 0.086984 0.108682 0.106665 0.107589 0.116825 0.119415 0.122210 0.123928 0.124405 0.131116 0.124460 0.125925 0.124627
qa: -0.0400 -0.0531 -0.2610 -0.3878 -0.2998 0.1092 -0.0559 -0.0847 -0.2380 -0.2767 -0.1720 0.3371 0.0941 0.0572 -0.0033 -0.1982 -0.1156 0.2116 -0.1295 -0.1704 0.2529 -0.2151 -0.1656 -0.0898 -0.1162 -0.1476 0.1020 0.0819 0.0728 0.0920 0.0891 0.1087 0.0886 0.0870 0.1087 0.1067 0.1076 0.1168 0.1194 0.1222 0.1239 0.1244 0.1311 0.1245 0.1259 0.1246
va: 1.3070 1.2547 2.1271 2.0876 2.1051 3.7317 3.9001 3.8595 3.9051 3.8990 3.9127 4.1648 4.1870 3.8662 3.6455 3.9301 3.9017 3.8104 3.9445 4.0036 3.8122 4.0388 3.9371 3.9325 3.9452 3.9620 1.0082 1.0348 1.0074 1.0044 1.0047 1.0183 0.9978 1.0050 1.0186 1.0106 0.9941 1.0174 1.0234 1.0039 1.0119 1.0147 1.0057 0.9989 0.9999 1.0005
dispcorr: -0.026877119 hartree
energy: -1958.447908105690
dipole: -3.48221 3.08395 -0.39826 9.99200 -9.68908 0.30292 21.95998 -21.09013 0.86985
magnitude: 1.00350 au
magnitude: 2.55069 debye
