program: Orca
programVersion: 5.0.2
elementType: Cl Cl O O O C C C C C C C C C C C C C C C C C C C C C H H H H H H H H H H H H H H H H H H H H
charge: 0
multiplicity: 1
keywords: wb97x-d3
keywords: def2-TZVPP
keywords: def2/J RIJCOSX
keywords: DEFGRID2
keywords: scfconv7
keywords: smallprint printgap noloewdin
keywords: NOSOSCF
formula: C21H20Cl2O3
InChI: InChI=1/C21H20Cl2O3/c1-21(2)17(12-18(22)23)19(21)20(24)25-13-14-7-6-10-16(11-14)26-15-8-4-3-5-9-15/h3-12,17,19H,13H2,1-2H3
46 atoms
Cl 0.059297 1.278834 2.16965
Cl -1.670094 -1.030484 2.088362
O  0.786654 2.616578 -1.275987
O  -0.882937 1.14054 -1.467226
O  1.485804 -2.584995 0.72285
C  -2.7528 3.388759 -0.497376
C  -2.193962 2.774663 0.741173
C  -1.252846 3.232356 -0.368906
C  -3.257132 4.809251 -0.38483
C  -3.553863 2.560112 -1.471922
C  -2.365607 1.339899 1.053093
C  -0.472816 2.208809 -1.097614
C  -1.451649 0.62572 1.693861
C  1.713835 1.651311 -1.782335
C  2.174953 0.730289 -0.688031
C  1.618758 -0.535492 -0.549181
C  3.124838 1.172554 0.226001
C  2.022653 -1.355511 0.497172
C  3.515328 0.350079 1.269998
C  2.972719 -0.91625 1.408385
C  1.024532 -3.344557 -0.312254
C  1.784542 -3.570713 -1.453879
C  -0.214746 -3.94797 -0.161381
C  1.291458 -4.405864 -2.44389
C  -0.691111 -4.790198 -1.154188
C  0.055938 -5.020807 -2.299639
H  -2.156612 3.414503 1.619179
H  -0.698914 4.139034 -0.156665
H  -4.29796 4.821512 -0.057149
H  -2.679004 5.395776 0.330284
H  -3.205224 5.316944 -1.349248
H  -4.604594 2.564391 -1.174563
H  -3.497153 2.99319 -2.471801
H  -3.223412 1.528896 -1.545372
H  -3.282331 0.842649 0.762848
H  1.280131 1.096365 -2.615469
H  2.546191 2.242563 -2.163216
H  0.854982 -0.864147 -1.241658
H  3.557535 2.15995 0.122624
H  4.255586 0.692006 1.981203
H  3.272754 -1.564875 2.22067
H  2.755575 -3.10523 -1.565502
H  -0.7944 -3.757263 0.731896
H  1.88547 -4.583632 -3.331108
H  -1.655885 -5.264403 -1.030622
H  -0.320605 -5.67492 -3.074447
totalener: -1958.42096367 hartree
nucrepener: 2722.84776872 hartree
electener: -4681.26873239 hartree
oneelecener: -8099.96015603 hartree
twoeener: 3418.69142365 hartree
kineticenergy: 1952.64406383 hartree
xcener: -143.521215845211 hartree
chargesum: 0.0000000
charge: -0.042190 -0.055691 -0.258827 -0.389909 -0.289194 0.108257 -0.055476 -0.087393 -0.238459 -0.276685 -0.174070 0.340965 0.102623 0.047620 -0.015854 -0.112098 -0.192514 0.204114 -0.088767 -0.212723 0.250076 -0.165314 -0.190662 -0.115198 -0.104224 -0.140848 0.101969 0.080395 0.088660 0.073226 0.091973 0.088084 0.087342 0.109691 0.109770 0.108537 0.109005 0.132181 0.105516 0.122558 0.122292 0.128194 0.121696 0.124617 0.123093 0.123647
qa: -0.0422 -0.0557 -0.2588 -0.3899 -0.2892 0.1083 -0.0555 -0.0874 -0.2385 -0.2767 -0.1741 0.3410 0.1026 0.0476 -0.0159 -0.1121 -0.1925 0.2041 -0.0888 -0.2127 0.2501 -0.1653 -0.1907 -0.1152 -0.1042 -0.1408 0.1020 0.0804 0.0887 0.0732 0.0920 0.0881 0.0873 0.1097 0.1098 0.1085 0.1090 0.1322 0.1055 0.1226 0.1223 0.1282 0.1217 0.1246 0.1231 0.1236
va: 1.3040 1.2573 2.1306 2.0800 2.1001 3.7286 3.9000 3.8551 3.9054 3.8995 3.9151 4.1589 4.1797 3.8669 3.6579 3.8016 4.0050 3.8313 3.9245 4.0495 3.8158 3.9577 4.0398 3.9444 3.9677 3.9641 1.0080 1.0352 1.0048 1.0073 1.0044 0.9978 1.0047 1.0186 1.0183 1.0112 0.9935 1.0291 1.0132 0.9995 1.0145 1.0064 1.0139 1.0000 1.0003 1.0004
dispcorr: -0.027965390 hartree
energy: -1958.448929055997
dipole: -6.88458 6.72044 -0.16414 11.16714 -10.26136 0.90579 -19.34534 18.92008 -0.42526
magnitude: 1.01402 au
magnitude: 2.57744 debye
