program: Orca
programVersion: 5.0.2
elementType: Cl Cl O O O C C C C C C C C C C C C C C C C C C C C C H H H H H H H H H H H H H H H H H H H H
charge: 0
multiplicity: 1
keywords: wb97x-d3
keywords: def2-TZVPP
keywords: def2/J RIJCOSX
keywords: DEFGRID2
keywords: scfconv7
keywords: smallprint printgap noloewdin
keywords: NOSOSCF
formula: C21H20Cl2O3
InChI: InChI=1/C21H20Cl2O3/c1-21(2)17(12-18(22)23)19(21)20(24)25-13-14-7-6-10-16(11-14)26-15-8-4-3-5-9-15/h3-12,17,19H,13H2,1-2H3
46 atoms
Cl -5.326513 2.145041 -0.814776
Cl -4.353557 3.860378 1.286567
O  1.172822 1.20644 -1.511833
O  0.213861 1.968401 0.36419
O  3.50406 -2.504349 1.077576
C  -1.803868 -0.359768 -0.29355
C  -2.454996 0.906207 -0.769326
C  -1.022689 0.596387 -1.174208
C  -2.240608 -1.643542 -0.957185
C  -1.452407 -0.541444 1.162435
C  -2.805997 2.004114 0.143407
C  0.146397 1.343978 -0.660941
C  -3.999574 2.582715 0.191671
C  2.427591 1.770773 -1.167931
C  3.384319 0.751232 -0.606175
C  2.947217 -0.445653 -0.056359
C  4.743025 1.047636 -0.615881
C  3.870239 -1.336952 0.478735
C  5.652763 0.155425 -0.0730
C  5.226015 -1.043533 0.472134
C  2.36368 -3.152299 0.702003
C  2.102273 -3.462068 -0.627452
C  1.493346 -3.557696 1.703309
C  0.964852 -4.187748 -0.944379
C  0.362611 -4.290287 1.373413
C  0.092269 -4.607027 0.050629
H  -3.154291 0.772233 -1.586921
H  -0.903357 0.275613 -2.202359
H  -2.498297 -1.496427 -2.006876
H  -1.446989 -2.390746 -0.906263
H  -3.118874 -2.052907 -0.454962
H  -0.665057 -1.290857 1.267676
H  -1.114229 0.366321 1.652944
H  -2.326982 -0.905332 1.70387
H  -2.055435 2.374236 0.827399
H  2.833476 2.184706 -2.092345
H  2.30047 2.592762 -0.460325
H  1.894689 -0.694429 -0.038993
H  5.09221 1.976781 -1.050077
H  6.709072 0.389081 -0.084281
H  5.929884 -1.749276 0.892499
H  2.785557 -3.147653 -1.405904
H  1.712473 -3.307653 2.733063
H  0.765844 -4.43547 -1.978814
H  -0.310661 -4.610858 2.15736
H  -0.788857 -5.180312 -0.204159
totalener: -1958.42503157 hartree
nucrepener: 2553.57881690 hartree
electener: -4512.00384847 hartree
oneelecener: -7760.08673100 hartree
twoeener: 3248.08288254 hartree
kineticenergy: 1952.59815531 hartree
xcener: -143.515616300190 hartree
chargesum: 0.0000000
charge: -0.053886 -0.046445 -0.268714 -0.386284 -0.295783 0.090490 0.054072 -0.094908 -0.228064 -0.242998 -0.238024 0.326892 0.040662 0.055002 0.045069 -0.165233 -0.210495 0.265339 -0.075652 -0.224481 0.243073 -0.160672 -0.200421 -0.103141 -0.093010 -0.174275 0.078069 0.086088 0.075991 0.074435 0.092222 0.065124 0.107269 0.097366 0.133649 0.107320 0.115855 0.098814 0.107072 0.124438 0.125329 0.132844 0.126723 0.131460 0.128018 0.133804
qa: -0.0539 -0.0464 -0.2687 -0.3863 -0.2958 0.0905 0.0541 -0.0949 -0.2281 -0.2430 -0.2380 0.3269 0.0407 0.0550 0.0451 -0.1652 -0.2105 0.2653 -0.0757 -0.2245 0.2431 -0.1607 -0.2004 -0.1031 -0.0930 -0.1743 0.0781 0.0861 0.0760 0.0744 0.0922 0.0651 0.1073 0.0974 0.1336 0.1073 0.1159 0.0988 0.1071 0.1244 0.1253 0.1328 0.1267 0.1315 0.1280 0.1338
va: 1.2744 1.2605 2.1351 2.0947 2.1152 3.7428 3.7909 3.9074 3.9050 3.9038 3.8964 4.1825 4.2427 3.8809 3.7258 3.9526 4.0197 3.7986 3.9531 4.0389 3.8016 3.9521 3.9910 3.8646 3.8713 3.9015 1.0339 1.0315 1.0117 1.0184 1.0056 1.0139 1.0208 1.0039 1.0386 0.9900 1.0102 1.0151 1.0107 0.9993 1.0144 1.0030 1.0140 0.9985 0.9989 0.9991
dispcorr: -0.025381722 hartree
energy: -1958.450413291421
dipole: 24.52285 -23.92629 0.59656 -26.84856 25.92313 -0.92543 -3.35430 2.59908 -0.75522
magnitude: 1.33516 au
magnitude: 3.39371 debye
