program: Orca
programVersion: 5.0.2
elementType: Cl Cl O O O C C C C C C C C C C C C C C C C C C C C C H H H H H H H H H H H H H H H H H H H H
charge: 0
multiplicity: 1
keywords: wb97x-d3
keywords: def2-TZVPP
keywords: def2/J RIJCOSX
keywords: DEFGRID2
keywords: scfconv7
keywords: smallprint printgap noloewdin
keywords: NOSOSCF
formula: C21H20Cl2O3
InChI: InChI=1/C21H20Cl2O3/c1-21(2)17(12-18(22)23)19(21)20(24)25-13-14-7-6-10-16(11-14)26-15-8-4-3-5-9-15/h3-12,17,19H,13H2,1-2H3
46 atoms
Cl -6.045394 2.417474 0.244402
Cl -5.751764 2.180691 -2.614436
O  0.299015 1.122966 -0.150129
O  -0.791995 2.085173 -1.841335
O  3.618411 -3.604696 -0.301127
C  -1.935957 3.92927 0.42061
C  -2.943509 2.829157 0.257371
C  -1.46861 2.489291 0.430484
C  -1.90668 4.626413 1.760641
C  -1.621211 4.852146 -0.730445
C  -3.660307 2.606129 -1.005381
C  -0.6535 1.905383 -0.658716
C  -4.971721 2.426838 -1.101638
C  1.188245 0.49714 -1.074685
C  2.207113 -0.272415 -0.288928
C  2.445355 -1.603498 -0.591452
C  2.938054 0.34152 0.724536
C  3.417057 -2.319591 0.097914
C  3.897289 -0.380554 1.411784
C  4.150378 -1.71077 1.106324
C  4.06241 -4.537868 0.592441
C  5.137172 -5.3301 0.218487
C  3.427931 -4.736272 1.812438
C  5.576664 -6.33184 1.071136
C  3.883402 -5.73408 2.659282
C  4.95636 -6.535595 2.294269
H  -3.528704 2.612532 1.143567
H  -1.214052 2.096145 1.407664
H  -2.630397 5.442735 1.783526
H  -2.145889 3.949476 2.581572
H  -0.919902 5.0497 1.956147
H  -0.635872 5.301209 -0.595415
H  -1.628547 4.367303 -1.701558
H  -2.352005 5.662005 -0.755654
H  -3.097989 2.58524 -1.92841
H  0.633879 -0.162865 -1.746123
H  1.671543 1.256711 -1.695611
H  1.878112 -2.102932 -1.367592
H  2.75818 1.378114 0.977285
H  4.469406 0.096782 2.19642
H  4.911873 -2.257106 1.647076
H  5.616607 -5.162649 -0.737048
H  2.583752 -4.120574 2.096333
H  6.412626 -6.952353 0.775963
H  3.387409 -5.89108 3.608136
H  5.303327 -7.315826 2.957975
totalener: -1958.42571453 hartree
nucrepener: 2351.12779765 hartree
electener: -4309.55351218 hartree
oneelecener: -7355.28348712 hartree
twoeener: 3045.72997494 hartree
kineticenergy: 1952.61130088 hartree
xcener: -143.512573830313 hartree
chargesum: 0.0000000
charge: -0.053313 -0.046098 -0.264343 -0.399291 -0.297803 0.070756 0.051158 -0.086266 -0.232535 -0.250556 -0.231147 0.352498 0.039191 0.064158 0.042730 -0.198751 -0.185246 0.208928 -0.114909 -0.154706 0.224766 -0.193570 -0.156595 -0.099324 -0.116850 -0.136649 0.077527 0.088171 0.092389 0.074137 0.088709 0.087436 0.103223 0.093022 0.133866 0.095057 0.108652 0.112159 0.111292 0.126165 0.132293 0.125815 0.134139 0.125837 0.127670 0.126208
qa: -0.0533 -0.0461 -0.2643 -0.3993 -0.2978 0.0708 0.0512 -0.0863 -0.2325 -0.2506 -0.2311 0.3525 0.0392 0.0642 0.0427 -0.1988 -0.1852 0.2089 -0.1149 -0.1547 0.2248 -0.1936 -0.1566 -0.0993 -0.1168 -0.1366 0.0775 0.0882 0.0924 0.0741 0.0887 0.0874 0.1032 0.0930 0.1339 0.0951 0.1087 0.1122 0.1113 0.1262 0.1323 0.1258 0.1341 0.1258 0.1277 0.1262
va: 1.2749 1.2605 2.1457 2.0890 2.1039 3.7690 3.7909 3.9191 3.9130 3.9116 3.8901 4.1426 4.2465 3.8228 3.7562 4.0500 4.0065 3.9076 3.9585 3.9311 3.8211 4.0327 3.9560 3.9351 3.9442 3.9536 1.0349 1.0281 1.0044 1.0084 1.0043 1.0021 1.0189 1.0021 1.0360 1.0082 0.9957 1.0246 1.0205 1.0011 1.0048 1.0128 1.0026 0.9991 0.9997 1.0001
dispcorr: -0.020571322 hartree
energy: -1958.446285847505
dipole: 36.38784 -35.21611 1.17173 -0.97502 1.01419 0.03917 14.76689 -13.56222 1.20467
magnitude: 1.68099 au
magnitude: 4.27273 debye
