program: Gaussian 09
title: 000067608
version: EM64L-G09RevD.01
frameworkgroup: C1[X(C8H8FNO3S)]
method: RPBEPBE
basis: SDD
operation: Freq
keyword: #p
keyword: freq=noraman
keyword: PBEPBE/SDD
title: #p freq=noraman PBEPBE/SDD
converged: NO NO NO NO
title: Mulliken charges:
elementType: S F O O O N C C C C C C C C H H H H H H H H
charge: 1.090153 -0.347541 -0.483366 -0.478414 -0.239075 -0.445556 -0.136473 0.512929 -0.206196 -0.188892 -0.314703 -0.416579 0.228176 -0.794561 0.286139 0.287502 0.325678 0.238975 0.319574 0.244407 0.276516 0.241307
chargesum: 0.00000
title: Mulliken charges with hydrogens summed into heavy atoms:
elementType: S F O O O N C C C C C C C C
charge: 1.090153 -0.347541 -0.483366 -0.478414 -0.239075 -0.125981 -0.136473 0.512929 0.079943 0.098610 0.010975 -0.177604 0.228176 -0.032331
polarizability: 2.21514985e+02 -1.03987994e-01 1.27230233e+02 4.28887688e+00 7.65363373e-01 6.91675214e+01
1716.lowfreq: -62.8223 -6.7707 -2.7757 0.0011 0.0017 0.0025 6.1565 27.7151 48.5723
frequency: -62.8184 27.2630 48.5666 74.9528 100.3875 106.7566 170.4472 181.1881 210.3229 234.7787 290.3845 314.4711 348.9092 362.8619 383.3065 412.1161 442.8047 509.2311 545.0766 566.1101 582.6641 616.3949 657.9149 675.9959 717.1208 815.7152 828.1944 849.3524 859.5963 928.1222 959.1024 978.4964 987.5298 989.0315 999.4623 1034.3325 1050.9301 1123.0230 1185.2989 1216.4995 1268.6036 1295.5616 1369.5068 1380.4942 1412.4198 1446.4903 1467.4457 1474.0065 1504.3472 1590.8564 1597.9665 1646.2816 2989.8402 3074.4221 3131.7701 3140.9245 3164.2821 3170.5609 3200.8244 3519.9511
redmass: 1.0515 7.9728 5.2913 4.9654 7.7617 6.4382 7.9411 6.2187 7.7351 10.8319 9.7036 7.6817 5.5278 6.9694 5.7400 2.9830 9.0322 3.3175 6.0825 7.0204 2.9199 6.9812 1.1964 6.1671 3.2117 4.6077 1.3849 16.8223 1.4571 6.4219 1.3528 2.8423 2.4450 10.1824 1.3411 1.6741 2.4204 1.3074 1.1250 3.3538 1.9070 1.4239 3.8138 1.2413 5.1205 1.1337 1.0472 2.2867 2.0608 6.3757 5.4196 5.2595 1.0388 1.0983 1.0905 1.0978 1.0918 1.0958 1.0953 1.0766
irintensity: 0.0460 3.3753 0.2225 6.6803 3.0267 1.6002 1.9710 7.5666 2.6813 5.8923 5.5509 0.9996 28.5183 7.5046 1.3739 0.0282 43.4082 21.9934 71.4145 173.5894 6.0264 4.4324 64.8227 3.9295 1.9075 1.4273 32.2690 119.0380 64.9027 2.9926 1.3263 32.7563 19.0683 65.9570 3.7588 8.8951 57.4024 9.3651 34.2799 94.0855 59.7940 66.5235 237.8892 73.4787 20.7190 40.3469 21.7565 40.0743 398.6785 119.9924 60.7982 116.6175 4.9884 11.4517 9.4955 5.2112 3.6092 6.0961 12.6644 19.1038
temp: 298.150 k
press: 1.00000 atm
elementType: 16 9 8 8 8 7 6 6 6 6 6 6 6 6 1 1 1 1 1 1 1 1
symmnumber: 1
zpe: 396151.0 jmol-1
zpe.correction: 0.150886 hartree
zpe.thermalcorrener: 0.164356 hartree
zpe.thermalcorrenthalpy: 0.165300 hartree
zpe.thermalcorrgfe: 0.109198 hartree
zpe.sumelectzpe: -1086.794432 hartree
zpe.sumelectthermal: -1086.780962 hartree
zpe.sumelectthermalent: -1086.780018 hartree
zpe.sumelectthermalfe: -1086.836120 hartree
dipole: 8.6127 4.4701 -0.4809
dipole: 9.7156
quadrupole: -97.0936 -86.5176 -94.3997
quadrupole: 14.0098 1.2699 0.1258
quadrupole: -4.4233 6.1527 -1.7294 14.0098 1.2699 0.1258
hfenergy: -1086.9453181 hartree
pointgroup: C01 [X(C8H8F1N1O3S1)]
dipole: -3.3648242 -1.8043898 -0.181318 debye
dipolederiv: 2.3671197 0.0880335 0.0212318 0.1595332 1.2048254 0.009595 0.142553 0.0199832 1.6175079 -0.6276134 -0.0261719 -0.0654766 -0.0477997 -0.3270967 -0.0176915 -0.4107698 -0.0451517 -0.8952396 -0.7515941 0.0193028 0.0285229 0.1378207 -0.5353849 -0.0716534 0.0650014 -0.0313248 -0.435409 -0.6944836 -0.0420096 0.0113112 -0.1770512 -0.552584 0.0788541 0.0563929 0.0457982 -0.4361317 -0.7041556 -0.0718495 0.0086853 0.539948 -0.9042175 -0.004502 -0.003762 0.0098001 -0.3247394 -2.2920668 0.2741558 0.038228 0.4512611 -0.39969 -0.0085618 0.025477 -0.0064104 -0.3289238 -0.5026031 0.0052598 0.0074077 -0.032962 -0.1530202 0.0017083 0.2566603 0.019836 -0.1755728 1.6667209 -0.0011875 -0.0352523 0.3533567 0.0944926 -0.0066736 -0.0431297 0.0013715 0.1355973 0.2189806 0.0725422 -0.0123595 -0.3134519 0.0264715 0.0070269 -0.0664165 -0.0170985 -0.0662314 0.1330163 -0.0607863 -0.0072249 0.3291895 0.0397302 -0.011749 -0.0753008 0.0049278 -0.0648125 -0.4838219 -0.0950225 0.0071354 -0.3208117 -0.0837254 0.0050937 0.0068768 0.0016162 -0.1449338 -0.5349138 0.0876914 0.0043141 0.2520627 0.0470832 -0.0073248 0.0033877 -0.007461 -0.1858455 1.9947163 -0.152299 -0.0346968 -1.0472272 1.215812 0.0103505 -0.0181845 -0.0092944 0.184486 -0.465961 -0.1175849 0.0117299 -0.2571 -0.1023523 0.0028694 0.0034629 -0.0024054 0.0480213 0.1108613 -0.0503206 0.0049753 -0.0224139 0.0687068 0.0018353 0.0048255 0.0102 0.1552337 0.0978571 0.0634834 0.0041436 0.0260543 0.0872582 0.0009689 0.004963 -0.0085192 0.1595178 0.1608354 0.0374232 0.0005849 -0.018088 0.0927279 0.0024448 0.0175886 0.0025261 0.185175 -0.0061711 -0.0982799 0.005956 -0.0803085 -0.0338051 0.003114 0.0181635 0.0048998 0.1709276 0.1741184 0.0231548 0.0029857 0.008485 0.106305 0.00293 0.0064594 0.0030751 0.3064073 0.0631924 -0.0046957 0.0232393 -0.0301399 0.0501804 -0.0993742 -0.0222449 -0.1010259 -0.0239982 0.0143321 0.0442707 0.0058256 0.1137529 0.0195493 -0.0064281 0.010359 -0.0024954 0.1354692 0.0616339 0.0048897 -0.0312667 -0.0241101 0.0387336 0.1071674 0.017637 0.1071527 -0.0165053 unknown
polarizability: 221.4945968|1.1430016|127.2388365|-4.3925628|-0.9980746|69.1793055 unknown
InChI: InChI=1S/C8H8FNO3S/c1-6(11)10-7-2-4-8(5-3-7)14(9,12)13/h2-5,10H,1H3
charge 0 multiplicity 1
22 atoms
S  3.317871 0.162463 -0.141348
F  3.634526 0.23742 1.691977
O  4.042376 -1.18171 -0.650406
O  3.700057 1.618248 -0.708181
O  -3.564997 1.499765 0.011728
N  -2.67591 -0.673639 0.022827
C  1.475905 -0.068227 -0.085819
C  -1.284323 -0.421238 -0.014128
C  0.655708 1.072523 -0.077993
C  0.978788 -1.38305 -0.053018
C  -0.740946 0.895729 -0.047576
C  -0.415262 -1.550816 -0.022419
C  -3.738114 0.250991 0.034613
C  -5.116248 -0.40372 0.070934
H  1.089598 2.076705 -0.107801
H  1.655304 -2.242731 -0.065199
H  -1.412756 1.75501 -0.045108
H  -0.830853 -2.565226 -0.001653
H  -2.945908 -1.660618 0.044097
H  -5.292526 -1.015246 -0.833473
H  -5.878841 0.386205 0.114648
H  -5.230649 -1.057237 0.955597
