program: Orca
programVersion: 5.0.2
elementType: Cl Cl O O O C C C C C C C C C C C C C C C C C C C C C H H H H H H H H H H H H H H H H H H H H
charge: 0
multiplicity: 1
keywords: wb97x-d3
keywords: def2-TZVPP
keywords: def2/J RIJCOSX
keywords: DEFGRID2
keywords: scfconv7
keywords: smallprint printgap noloewdin
keywords: NOSOSCF
formula: C21H20Cl2O3
InChI: InChI=1/C21H20Cl2O3/c1-21(2)17(12-18(22)23)19(21)20(24)25-13-14-7-6-10-16(11-14)26-15-8-4-3-5-9-15/h3-12,17,19H,13H2,1-2H3
46 atoms
Cl -5.743272 2.744349 -0.875837
Cl -4.373736 3.830814 -3.166641
O  -0.160447 -0.427157 -0.497473
O  -0.204943 1.619106 -1.403918
O  4.677474 -2.614685 1.203184
C  -1.851046 2.372725 1.127714
C  -2.8811 1.953226 0.120655
C  -1.680124 1.055675 0.403016
C  -2.248018 2.261295 2.581008
C  -0.946289 3.549673 0.858339
C  -3.059598 2.648038 -1.161391
C  -0.615313 0.821704 -0.598989
C  -4.234328 3.018311 -1.656962
C  0.883827 -0.850561 -1.382405
C  2.233638 -0.680316 -0.746167
C  2.802922 -1.749949 -0.062732
C  2.909744 0.531338 -0.822592
C  4.041247 -1.605358 0.549198
C  4.14656 0.664561 -0.209076
C  4.715873 -0.392713 0.478846
C  3.97387 -3.715397 1.607616
C  2.954472 -3.607649 2.544933
C  4.336519 -4.951265 1.096322
C  2.294881 -4.751644 2.964663
C  3.675143 -6.090739 1.531717
C  2.651043 -5.995295 2.461055
H  -3.800113 1.565476 0.54464
H  -1.912219 0.174014 0.988536
H  -2.908297 1.412551 2.763154
H  -1.367993 2.139943 3.2149
H  -2.771125 3.162641 2.904492
H  -1.448308 4.468199 1.165975
H  -0.029741 3.461347 1.443816
H  -0.658367 3.659428 -0.182022
H  -2.185909 2.880188 -1.754485
H  0.681363 -1.904303 -1.573337
H  0.823979 -0.313257 -2.329074
H  2.276489 -2.695463 -0.018677
H  2.472224 1.363407 -1.357227
H  4.677102 1.605761 -0.26703
H  5.681804 -0.292246 0.956069
H  2.682032 -2.637728 2.941231
H  5.135448 -5.015054 0.369291
H  1.500769 -4.669868 3.69491
H  3.960781 -7.056708 1.13695
H  2.135063 -6.885147 2.79501
totalener: -1958.42568635 hartree
nucrepener: 2423.60558018 hartree
electener: -4382.03126654 hartree
oneelecener: -7500.34910659 hartree
twoeener: 3118.31784006 hartree
kineticenergy: 1952.60870173 hartree
xcener: -143.512532751341 hartree
chargesum: -0.0000000
charge: -0.052579 -0.046898 -0.261727 -0.419332 -0.296552 0.075967 0.049018 -0.105504 -0.233361 -0.252353 -0.231564 0.394529 0.038619 0.048462 -0.014194 -0.189664 -0.165570 0.243497 -0.088932 -0.207663 0.224590 -0.163267 -0.180706 -0.114919 -0.107258 -0.131150 0.076101 0.086372 0.072765 0.089944 0.091959 0.091651 0.089073 0.102688 0.133056 0.098912 0.115491 0.113924 0.135250 0.125585 0.124635 0.132563 0.126288 0.127594 0.127194 0.127463
qa: -0.0526 -0.0469 -0.2617 -0.4193 -0.2966 0.0760 0.0490 -0.1055 -0.2334 -0.2524 -0.2316 0.3945 0.0386 0.0485 -0.0142 -0.1897 -0.1656 0.2435 -0.0889 -0.2077 0.2246 -0.1633 -0.1807 -0.1149 -0.1073 -0.1311 0.0761 0.0864 0.0728 0.0899 0.0920 0.0917 0.0891 0.1027 0.1331 0.0989 0.1155 0.1139 0.1353 0.1256 0.1246 0.1326 0.1263 0.1276 0.1272 0.1275
va: 1.2759 1.2596 2.1478 2.0617 2.1109 3.7601 3.7894 3.9115 3.9130 3.9135 3.8947 4.1148 4.2457 3.8435 3.7544 3.9718 3.9604 3.8483 3.9540 4.0309 3.8288 3.9779 4.0326 3.9383 3.9364 3.9494 1.0348 1.0304 1.0088 1.0041 1.0041 1.0021 1.0021 1.0190 1.0361 1.0010 1.0132 1.0167 1.0199 0.9994 1.0137 1.0038 1.0119 0.9997 0.9992 1.0000
dispcorr: -0.021541716 hartree
energy: -1958.447228068491
dipole: 27.05048 -26.70758 0.34290 -14.83579 13.98167 -0.85411 21.63313 -20.69700 0.93612
magnitude: 1.31279 au
magnitude: 3.33685 debye
