program: Orca
programVersion: 5.0.2
elementType: Cl Cl O O O C C C C C C C C C C C C C C C C C C C C C H H H H H H H H H H H H H H H H H H H H
charge: 0
multiplicity: 1
keywords: wb97x-d3
keywords: def2-TZVPP
keywords: def2/J RIJCOSX
keywords: DEFGRID2
keywords: scfconv7
keywords: smallprint printgap noloewdin
keywords: NOSOSCF
formula: C21H20Cl2O3
InChI: InChI=1/C21H20Cl2O3/c1-21(2)17(12-18(22)23)19(21)20(24)25-13-14-7-6-10-16(11-14)26-15-8-4-3-5-9-15/h3-12,17,19H,13H2,1-2H3
46 atoms
Cl -5.027779 0.588569 -0.238438
Cl -3.912514 0.361476 -2.88729
O  1.155036 2.389547 0.864639
O  0.17675 2.661405 -1.126591
O  3.595081 -2.368119 1.465496
C  -2.186313 3.786341 0.585253
C  -2.500081 2.33314 0.379691
C  -1.125263 2.750273 0.888521
C  -2.804491 4.449475 1.793217
C  -2.06888 4.71548 -0.597227
C  -2.701674 1.756783 -0.956906
C  0.101801 2.597529 0.07418
C  -3.741021 1.007518 -1.302389
C  2.424666 2.165453 0.242487
C  2.599656 0.724723 -0.144311
C  2.985927 -0.198868 0.819826
C  2.358236 0.296871 -1.444408
C  3.147681 -1.534516 0.485343
C  2.519307 -1.04124 -1.769814
C  2.917934 -1.96374 -0.816509
C  3.13585 -3.650261 1.545832
C  4.055176 -4.629435 1.893224
C  1.798419 -3.9756 1.352708
C  3.632185 -5.939683 2.053678
C  1.392378 -5.29236 1.504532
C  2.3022 -6.278933 1.855621
H  -3.115188 1.885942 1.15223
H  -0.962865 2.555118 1.941949
H  -2.901738 3.763098 2.635148
H  -2.199168 5.29553 2.122957
H  -3.801217 4.824659 1.555618
H  -3.062176 5.070063 -0.876801
H  -1.469164 5.588103 -0.333238
H  -1.618895 4.261898 -1.474596
H  -1.96271 1.944616 -1.72312
H  2.552374 2.822602 -0.618607
H  3.154821 2.450189 0.999573
H  3.174673 0.114914 1.839711
H  2.041048 1.006092 -2.196212
H  2.338758 -1.373472 -2.783429
H  3.053227 -3.00314 -1.086093
H  5.09181 -4.357311 2.042255
H  1.078329 -3.211001 1.090978
H  4.351443 -6.699942 2.328176
H  0.350755 -5.54417 1.354964
H  1.976209 -7.30296 1.97675
totalener: -1958.42584956 hartree
nucrepener: 2454.16306122 hartree
electener: -4412.58891078 hartree
oneelecener: -7561.63520525 hartree
twoeener: 3149.04629447 hartree
kineticenergy: 1952.61839349 hartree
xcener: -143.514460321771 hartree
chargesum: -0.0000000
charge: -0.053125 -0.047709 -0.263287 -0.418454 -0.299203 0.074560 0.048647 -0.107459 -0.233830 -0.251317 -0.228501 0.394174 0.038076 0.054978 -0.006757 -0.228183 -0.121916 0.224882 -0.118328 -0.162179 0.247036 -0.212318 -0.167376 -0.089919 -0.115980 -0.146078 0.077380 0.086490 0.073737 0.089861 0.092372 0.092119 0.087797 0.103163 0.133570 0.110452 0.107544 0.110609 0.124674 0.128423 0.134095 0.124277 0.134673 0.124899 0.127823 0.125607
qa: -0.0531 -0.0477 -0.2633 -0.4185 -0.2992 0.0746 0.0486 -0.1075 -0.2338 -0.2513 -0.2285 0.3942 0.0381 0.0550 -0.0068 -0.2282 -0.1219 0.2249 -0.1183 -0.1622 0.2470 -0.2123 -0.1674 -0.0899 -0.1160 -0.1461 0.0774 0.0865 0.0737 0.0899 0.0924 0.0921 0.0878 0.1032 0.1336 0.1105 0.1075 0.1106 0.1247 0.1284 0.1341 0.1243 0.1347 0.1249 0.1278 0.1256
va: 1.2752 1.2589 2.1452 2.0641 2.1046 3.7615 3.7913 3.9206 3.9133 3.9116 3.8841 4.1186 4.2433 3.8444 3.6928 4.0921 3.9520 3.8683 3.9685 3.9464 3.8028 4.0385 3.9423 3.9333 3.9493 3.9620 1.0329 1.0299 1.0086 1.0042 1.0042 1.0024 1.0021 1.0190 1.0373 1.0111 0.9964 1.0245 1.0234 1.0008 1.0029 1.0145 1.0034 0.9990 0.9998 1.0004
dispcorr: -0.021547047 hartree
energy: -1958.447396610099
dipole: 20.09211 -19.71382 0.37829 8.57612 -8.28696 0.28917 12.72759 -12.08017 0.64741
magnitude: 0.80365 au
magnitude: 2.04273 debye
