program: Orca
programVersion: 5.0.2
elementType: Cl Cl O O O C C C C C C C C C C C C C C C C C C C C C H H H H H H H H H H H H H H H H H H H H
charge: 0
multiplicity: 1
keywords: wb97x-d3
keywords: def2-TZVPP
keywords: def2/J RIJCOSX
keywords: DEFGRID2
keywords: scfconv7
keywords: smallprint printgap noloewdin
keywords: NOSOSCF
formula: C21H20Cl2O3
InChI: InChI=1/C21H20Cl2O3/c1-21(2)17(12-18(22)23)19(21)20(24)25-13-14-7-6-10-16(11-14)26-15-8-4-3-5-9-15/h3-12,17,19H,13H2,1-2H3
46 atoms
Cl -3.81668 -1.033375 -1.017532
Cl -1.785644 -1.233162 -3.060614
O  1.1401 2.457859 1.306736
O  0.522956 2.710487 -0.823366
O  2.549571 -2.342475 0.255506
C  -2.393343 2.700094 0.213311
C  -2.050143 1.239989 0.159544
C  -1.117566 2.221061 0.862653
C  -3.490433 3.099269 1.172883
C  -2.389308 3.524606 -1.05005
C  -1.652355 0.567219 -1.087306
C  0.23344 2.496356 0.323762
C  -2.333088 -0.424447 -1.645855
C  2.506664 2.536344 0.915348
C  2.968699 1.302297 0.188444
C  2.506418 0.050704 0.581753
C  3.884317 1.408028 -0.846996
C  2.954677 -1.087061 -0.074702
C  4.344095 0.2619 -1.480122
C  3.881983 -0.986248 -1.105984
C  1.414629 -2.495909 1.006867
C  0.167225 -2.333123 0.42085
C  1.532677 -2.847095 2.341977
C  -0.971781 -2.530545 1.185606
C  0.385587 -3.045435 3.097398
C  -0.866582 -2.884427 2.524065
H  -2.602232 0.60819 0.846911
H  -1.140528 2.152146 1.943829
H  -3.501897 2.477397 2.069225
H  -3.367831 4.136469 1.489839
H  -4.467761 3.009738 0.695624
H  -3.364003 3.440945 -1.533503
H  -2.22494 4.577499 -0.815925
H  -1.633499 3.22556 -1.768604
H  -0.74557 0.87791 -1.589678
H  2.687346 3.426355 0.308406
H  3.050706 2.653679 1.853559
H  1.795604 -0.034482 1.393931
H  4.228006 2.38226 -1.170692
H  5.056119 0.343192 -2.290721
H  4.223703 -1.881841 -1.607542
H  0.090198 -2.067145 -0.625798
H  2.514839 -2.969894 2.77952
H  -1.945978 -2.413457 0.72986
H  0.474803 -3.324199 4.139063
H  -1.758906 -3.042198 3.114899
totalener: -1958.42447403 hartree
nucrepener: 2678.91282287 hartree
electener: -4637.33729690 hartree
oneelecener: -8011.07460270 hartree
twoeener: 3373.73730580 hartree
kineticenergy: 1952.61986737 hartree
xcener: -143.516752702318 hartree
chargesum: 0.0000000
charge: -0.055804 -0.044560 -0.277038 -0.382970 -0.300514 0.105664 0.017230 -0.076189 -0.236575 -0.248715 -0.230439 0.325397 0.031682 0.070318 0.047969 -0.228984 -0.186410 0.262088 -0.076499 -0.218404 0.205861 -0.136247 -0.164548 -0.137701 -0.117849 -0.130438 0.078354 0.089004 0.073306 0.092364 0.091830 0.087339 0.088409 0.107771 0.146195 0.102666 0.106982 0.122265 0.101868 0.122421 0.123239 0.132780 0.125519 0.139012 0.126010 0.126345
qa: -0.0558 -0.0446 -0.2770 -0.3830 -0.3005 0.1057 0.0172 -0.0762 -0.2366 -0.2487 -0.2304 0.3254 0.0317 0.0703 0.0480 -0.2290 -0.1864 0.2621 -0.0765 -0.2184 0.2059 -0.1362 -0.1645 -0.1377 -0.1178 -0.1304 0.0784 0.0890 0.0733 0.0924 0.0918 0.0873 0.0884 0.1078 0.1462 0.1027 0.1070 0.1223 0.1019 0.1224 0.1232 0.1328 0.1255 0.1390 0.1260 0.1263
va: 1.2721 1.2593 2.1247 2.0962 2.1151 3.8059 3.8256 3.9152 3.9061 3.9096 3.7993 4.1708 4.1924 3.8581 3.7151 3.9048 4.0400 3.8133 3.9501 4.0473 3.8953 3.9711 4.0007 3.8885 3.9428 3.9736 1.0251 1.0294 1.0083 1.0040 1.0054 1.0026 1.0032 1.0188 1.0283 1.0100 0.9874 1.0304 1.0131 0.9992 1.0146 1.0106 1.0104 1.0189 0.9991 1.0008
dispcorr: -0.027232972 hartree
energy: -1958.451707003377
dipole: 5.91947 -6.07659 -0.15712 18.92067 -18.22358 0.69709 16.07508 -15.03744 1.03763
magnitude: 1.25989 au
magnitude: 3.20238 debye
