program: Orca
programVersion: 5.0.2
elementType: Cl Cl O O O C C C C C C C C C C C C C C C C C C C C C H H H H H H H H H H H H H H H H H H H H
charge: 0
multiplicity: 1
keywords: wb97x-d3
keywords: def2-TZVPP
keywords: def2/J RIJCOSX
keywords: DEFGRID2
keywords: scfconv7
keywords: smallprint printgap noloewdin
keywords: NOSOSCF
formula: C21H20Cl2O3
InChI: InChI=1/C21H20Cl2O3/c1-21(2)17(12-18(22)23)19(21)20(24)25-13-14-7-6-10-16(11-14)26-15-8-4-3-5-9-15/h3-12,17,19H,13H2,1-2H3
46 atoms
Cl -5.242206 4.069132 -0.830764
Cl -3.437355 5.005228 -2.87395
O  -0.794876 -0.757698 -0.724531
O  -0.340218 1.296963 -1.470994
O  3.495591 -2.214514 2.021515
C  -1.872514 2.143077 1.136268
C  -2.882709 2.206541 0.028391
C  -2.029425 0.958973 0.204006
C  -2.408779 1.944011 2.534103
C  -0.6419 3.014598 1.096609
C  -2.732272 3.118528 -1.114649
C  -0.972755 0.56537 -0.754331
C  -3.679113 3.944604 -1.541607
C  0.257092 -1.294342 -1.530053
C  1.603457 -1.079118 -0.897611
C  1.938531 -1.782242 0.253931
C  2.508178 -0.167849 -1.430489
C  3.169167 -1.574736 0.858808
C  3.7376 0.029415 -0.821711
C  4.077078 -0.674835 0.322975
C  3.607051 -3.572173 2.035453
C  3.868837 -4.326398 0.898077
C  3.485486 -4.190188 3.274417
C  4.004244 -5.702657 1.012941
C  3.627657 -5.563694 3.37188
C  3.884147 -6.329566 2.24293
H  -3.909521 2.056207 0.341335
H  -2.556412 0.111694 0.626912
H  -3.306976 1.325555 2.546259
H  -1.663953 1.462355 3.169712
H  -2.662947 2.904437 2.985546
H  0.149077 2.578478 1.708626
H  -0.238137 3.164394 0.099979
H  -0.880091 3.995376 1.510946
H  -1.793463 3.134727 -1.650213
H  0.029803 -2.358098 -1.599778
H  0.22606 -0.873847 -2.536613
H  1.240295 -2.490061 0.686445
H  2.241919 0.398591 -2.312543
H  4.438627 0.739637 -1.239592
H  5.033852 -0.527776 0.806301
H  3.974962 -3.852491 -0.068801
H  3.284821 -3.588663 4.15125
H  4.211485 -6.286271 0.125537
H  3.532509 -6.038782 4.339374
H  3.99215 -7.402542 2.322967
totalener: -1958.42545949 hartree
nucrepener: 2433.20266157 hartree
electener: -4391.62812105 hartree
oneelecener: -7519.60314083 hartree
twoeener: 3127.97501978 hartree
kineticenergy: 1952.61660635 hartree
xcener: -143.513487176132 hartree
chargesum: -0.0000000
charge: -0.053353 -0.047175 -0.266812 -0.410113 -0.300318 0.070668 0.050124 -0.106808 -0.234913 -0.250913 -0.230349 0.391522 0.039655 0.056509 -0.022550 -0.171960 -0.099478 0.178293 -0.118184 -0.166542 0.244363 -0.150982 -0.208154 -0.132003 -0.091732 -0.148532 0.077776 0.086496 0.073088 0.091516 0.092508 0.091966 0.101086 0.093316 0.133565 0.113539 0.106346 0.120940 0.117671 0.127418 0.128345 0.127235 0.123462 0.125573 0.123919 0.123973
qa: -0.0534 -0.0472 -0.2668 -0.4101 -0.3003 0.0707 0.0501 -0.1068 -0.2349 -0.2509 -0.2303 0.3915 0.0397 0.0565 -0.0225 -0.1720 -0.0995 0.1783 -0.1182 -0.1665 0.2444 -0.1510 -0.2082 -0.1320 -0.0917 -0.1485 0.0778 0.0865 0.0731 0.0915 0.0925 0.0920 0.1011 0.0933 0.1336 0.1135 0.1063 0.1209 0.1177 0.1274 0.1283 0.1272 0.1235 0.1256 0.1239 0.1240
va: 1.2750 1.2596 2.1384 2.0770 2.0985 3.7758 3.7844 3.9164 3.9115 3.9139 3.8883 4.1245 4.2410 3.8614 3.6671 3.9941 3.9416 3.8730 3.9537 4.0206 3.8133 3.9039 4.0229 3.9694 3.9473 3.9607 1.0341 1.0301 1.0087 1.0042 1.0040 1.0022 1.0188 1.0019 1.0371 0.9926 1.0103 1.0159 1.0207 0.9998 1.0091 1.0091 1.0149 1.0003 0.9987 1.0007
dispcorr: -0.021917633 hartree
energy: -1958.447377118136
dipole: 25.40629 -25.04274 0.36356 -25.63680 24.68580 -0.95099 19.32183 -18.82941 0.49242
magnitude: 1.13095 au
magnitude: 2.87464 debye
