program: Orca
programVersion: 5.0.2
elementType: Cl Cl O O O C C C C C C C C C C C C C C C C C C C C C H H H H H H H H H H H H H H H H H H H H
charge: 0
multiplicity: 1
keywords: wb97x-d3
keywords: def2-TZVPP
keywords: def2/J RIJCOSX
keywords: DEFGRID2
keywords: scfconv7
keywords: smallprint printgap noloewdin
keywords: NOSOSCF
formula: C21H20Cl2O3
InChI: InChI=1/C21H20Cl2O3/c1-21(2)17(12-18(22)23)19(21)20(24)25-13-14-7-6-10-16(11-14)26-15-8-4-3-5-9-15/h3-12,17,19H,13H2,1-2H3
46 atoms
Cl -5.280571 3.999711 0.425648
Cl -5.579032 1.339051 1.491564
O  0.98845 2.384957 1.004128
O  -0.644397 0.863865 0.908375
O  3.022962 -3.15093 0.931956
C  -1.5433 2.641807 -1.524019
C  -2.395035 3.065481 -0.361984
C  -0.884578 2.98245 -0.203157
C  -1.350584 3.657089 -2.625646
C  -1.581689 1.221982 -2.033116
C  -3.315061 2.148917 0.324185
C  -0.216089 1.949184 0.618365
C  -4.55183 2.461846 0.690577
C  1.813105 1.4569 1.700863
C  2.379116 0.400954 0.792284
C  2.414787 -0.917257 1.2128
C  2.904269 0.74202 -0.452154
C  2.992491 -1.895477 0.411058
C  3.460401 -0.241255 -1.251012
C  3.516938 -1.563453 -0.83071
C  3.273116 -4.219633 0.115268
C  4.454298 -4.923072 0.287371
C  2.33838 -4.622223 -0.828958
C  4.696971 -6.04887 -0.486969
C  2.594884 -5.743676 -1.601881
C  3.771885 -6.460617 -1.433964
H  -2.750415 4.088139 -0.413859
H  -0.380991 3.941639 -0.175063
H  -1.332698 4.678888 -2.244521
H  -0.411301 3.482919 -3.153501
H  -2.160093 3.590272 -3.354421
H  -2.405421 1.111412 -2.740154
H  -0.656437 0.98755 -2.561916
H  -1.707752 0.474768 -1.255639
H  -2.976954 1.150139 0.560429
H  2.615386 2.06627 2.119115
H  1.270063 1.001297 2.531531
H  1.987779 -1.203005 2.166482
H  2.880255 1.768359 -0.795292
H  3.871019 0.020201 -2.217739
H  3.968337 -2.314723 -1.46461
H  5.169248 -4.593641 1.030051
H  1.417142 -4.066235 -0.948894
H  5.615594 -6.603808 -0.348941
H  1.865884 -6.062691 -2.33515
H  3.963719 -7.33855 -2.035973
totalener: -1958.42498250 hartree
nucrepener: 2432.74725029 hartree
electener: -4391.17223278 hartree
oneelecener: -7518.84016078 hartree
twoeener: 3127.66792800 hartree
kineticenergy: 1952.61102699 hartree
xcener: -143.513188200806 hartree
chargesum: 0.0000000
charge: -0.054203 -0.047374 -0.274346 -0.388641 -0.295054 0.064357 0.053769 -0.078731 -0.234072 -0.248008 -0.229818 0.348485 0.039484 0.071906 0.062461 -0.197783 -0.232622 0.235295 -0.104657 -0.173970 0.193430 -0.162968 -0.143747 -0.115904 -0.122554 -0.122160 0.075745 0.085793 0.073555 0.088368 0.092633 0.093622 0.087577 0.101079 0.130428 0.108609 0.102880 0.105347 0.117257 0.125068 0.127965 0.125482 0.135063 0.126332 0.127720 0.126903
qa: -0.0542 -0.0474 -0.2743 -0.3886 -0.2951 0.0644 0.0538 -0.0787 -0.2341 -0.2480 -0.2298 0.3485 0.0395 0.0719 0.0625 -0.1978 -0.2326 0.2353 -0.1047 -0.1740 0.1934 -0.1630 -0.1437 -0.1159 -0.1226 -0.1222 0.0757 0.0858 0.0736 0.0884 0.0926 0.0936 0.0876 0.1011 0.1304 0.1086 0.1029 0.1053 0.1173 0.1251 0.1280 0.1255 0.1351 0.1263 0.1277 0.1269
va: 1.2741 1.2591 2.1278 2.0977 2.1070 3.7863 3.7940 3.8764 3.9108 3.9118 3.9029 4.1684 4.2434 3.8529 3.6884 4.0800 4.0023 3.8722 3.9543 3.9347 3.8551 4.0185 3.9791 3.9396 3.9409 3.9393 1.0361 1.0305 1.0086 1.0047 1.0041 1.0015 1.0038 1.0201 1.0384 0.9866 1.0121 1.0267 1.0198 1.0004 1.0094 1.0110 1.0029 0.9995 0.9998 0.9998
dispcorr: -0.021961681 hartree
energy: -1958.446944177706
dipole: 33.80139 -32.56368 1.23771 -11.57108 11.67148 0.10040 -19.31983 18.36027 -0.95955
magnitude: 1.56931 au
magnitude: 3.98888 debye
