program: Orca
programVersion: 5.0.2
elementType: Cl Cl O O O C C C C C C C C C C C C C C C C C C C C C H H H H H H H H H H H H H H H H H H H H
charge: 0
multiplicity: 1
keywords: wb97x-d3
keywords: def2-TZVPP
keywords: def2/J RIJCOSX
keywords: DEFGRID2
keywords: scfconv7
keywords: smallprint printgap noloewdin
keywords: NOSOSCF
formula: C21H20Cl2O3
InChI: InChI=1/C21H20Cl2O3/c1-21(2)17(12-18(22)23)19(21)20(24)25-13-14-7-6-10-16(11-14)26-15-8-4-3-5-9-15/h3-12,17,19H,13H2,1-2H3
46 atoms
Cl -5.631059 2.632543 -1.365038
Cl -3.965842 4.154685 -3.158443
O  -0.100395 -0.458079 -0.707162
O  -0.051384 1.726737 -1.184522
O  4.542144 -2.71048 1.324174
C  -2.059973 1.997782 1.171331
C  -2.926108 1.766171 -0.03198
C  -1.751531 0.834551 0.255209
C  -2.654283 1.620665 2.508353
C  -1.15856 3.204855 1.253524
C  -2.935993 2.674685 -1.185697
C  -0.556887 0.790894 -0.618511
C  -4.031877 3.089456 -1.809959
C  1.061761 -0.701817 -1.508152
C  2.321156 -0.591661 -0.696623
C  2.817086 -1.722192 -0.055495
C  2.989325 0.620984 -0.575243
C  3.972995 -1.637531 0.709767
C  4.144657 0.693763 0.188463
C  4.638816 -0.425153 0.836332
C  3.783078 -3.799647 1.647451
C  2.649878 -3.681868 2.442669
C  4.208063 -5.04245 1.204505
C  1.940119 -4.821373 2.786002
C  3.495045 -6.176883 1.564671
C  2.357378 -6.07127 2.349644
H  -3.884967 1.306668 0.177753
H  -2.038685 -0.139701 0.632548
H  -3.231789 2.450977 2.917893
H  -3.319943 0.759847 2.435064
H  -1.869505 1.374097 3.22551
H  -0.736553 3.509663 0.301594
H  -1.721356 4.048117 1.656838
H  -0.3268 3.007927 1.931735
H  -1.993011 3.037081 -1.570802
H  0.934591 -1.718576 -1.879291
H  1.084502 -0.026702 -2.364129
H  2.302213 -2.668932 -0.166201
H  2.607184 1.501167 -1.073365
H  4.668563 1.635634 0.282845
H  5.541684 -0.372271 1.430376
H  2.327762 -2.708664 2.790736
H  5.095149 -5.115162 0.589128
H  1.057953 -4.730536 3.405839
H  3.83029 -7.147125 1.222664
H  1.801277 -6.957186 2.624588
totalener: -1958.42581750 hartree
nucrepener: 2430.97026692 hartree
electener: -4389.39608442 hartree
oneelecener: -7515.07221198 hartree
twoeener: 3125.67612756 hartree
kineticenergy: 1952.61057524 hartree
xcener: -143.513024221478 hartree
chargesum: -0.0000000
charge: -0.052624 -0.046684 -0.261609 -0.419623 -0.297227 0.071569 0.051264 -0.100615 -0.233054 -0.250601 -0.231830 0.394672 0.037992 0.049026 -0.015708 -0.185709 -0.155617 0.235272 -0.092662 -0.206951 0.234715 -0.166829 -0.193846 -0.111486 -0.099140 -0.138371 0.075470 0.086413 0.091681 0.072967 0.089675 0.102513 0.090846 0.089409 0.131561 0.102259 0.114118 0.116066 0.132354 0.125979 0.125573 0.132219 0.126381 0.127205 0.126017 0.126968
qa: -0.0526 -0.0467 -0.2616 -0.4196 -0.2972 0.0716 0.0513 -0.1006 -0.2331 -0.2506 -0.2318 0.3947 0.0380 0.0490 -0.0157 -0.1857 -0.1556 0.2353 -0.0927 -0.2070 0.2347 -0.1668 -0.1938 -0.1115 -0.0991 -0.1384 0.0755 0.0864 0.0917 0.0730 0.0897 0.1025 0.0908 0.0894 0.1316 0.1023 0.1141 0.1161 0.1324 0.1260 0.1256 0.1322 0.1264 0.1272 0.1260 0.1270
va: 1.2758 1.2598 2.1477 2.0617 2.1095 3.7652 3.7876 3.9004 3.9130 3.9125 3.8968 4.1158 4.2473 3.8470 3.7350 3.9669 3.9583 3.8504 3.9550 4.0302 3.8213 3.9689 4.0376 3.9391 3.9327 3.9560 1.0354 1.0300 1.0044 1.0087 1.0041 1.0193 1.0021 1.0018 1.0366 0.9997 1.0124 1.0152 1.0215 0.9995 1.0132 1.0039 1.0127 0.9997 0.9992 1.0002
dispcorr: -0.021554868 hartree
energy: -1958.447372366891
dipole: 23.90756 -23.69727 0.21029 -17.52337 16.60647 -0.91690 23.54222 -22.69173 0.85049
magnitude: 1.26817 au
magnitude: 3.22343 debye
