program: Orca
programVersion: 5.0.2
elementType: Cl Cl O O O C C C C C C C C C C C C C C C C C C C C C H H H H H H H H H H H H H H H H H H H H
charge: 0
multiplicity: 1
keywords: wb97x-d3
keywords: def2-TZVPP
keywords: def2/J RIJCOSX
keywords: DEFGRID2
keywords: scfconv7
keywords: smallprint printgap noloewdin
keywords: NOSOSCF
formula: C21H20Cl2O3
InChI: InChI=1/C21H20Cl2O3/c1-21(2)17(12-18(22)23)19(21)20(24)25-13-14-7-6-10-16(11-14)26-15-8-4-3-5-9-15/h3-12,17,19H,13H2,1-2H3
46 atoms
Cl -5.424847 2.37882 0.271336
Cl -5.079377 -0.468336 0.565821
O  0.91734 2.163474 1.605474
O  -0.13094 0.417034 0.688566
O  4.147715 -2.369624 -0.216544
C  -1.303351 2.601212 -1.22488
C  -2.3247 2.44135 -0.136906
C  -0.861472 2.659206 0.222456
C  -1.29789 3.923505 -1.955966
C  -0.937917 1.437287 -2.112494
C  -3.016528 1.170037 0.111295
C  -0.022019 1.606562 0.836056
C  -4.326168 1.052398 0.290674
C  1.888212 1.287438 2.177657
C  2.853935 0.782267 1.142914
C  3.024522 -0.581709 0.961495
C  3.573486 1.681452 0.363058
C  3.905639 -1.048157 -0.006647
C  4.456949 1.207915 -0.592947
C  4.623361 -0.153645 -0.78819
C  3.18446 -3.316135 -0.020197
C  1.847494 -3.11533 -0.343426
C  3.613103 -4.541984 0.469991
C  0.944642 -4.151646 -0.158538
C  2.701082 -5.571681 0.636491
C  1.362186 -5.381173 0.328826
H  -2.93334 3.319251 0.045792
H  -0.636118 3.652092 0.593293
H  -0.310976 4.132444 -2.372222
H  -2.011782 3.90732 -2.780971
H  -1.565944 4.755089 -1.303301
H  -0.950326 0.475662 -1.609364
H  -1.637407 1.386009 -2.948243
H  0.062265 1.57743 -2.525355
H  -2.435699 0.259355 0.153882
H  2.400509 1.899373 2.920373
H  1.40439 0.458412 2.69801
H  2.453865 -1.275338 1.565783
H  3.442964 2.747501 0.499696
H  5.019585 1.904124 -1.200855
H  5.305757 -0.529672 -1.538847
H  1.504433 -2.162845 -0.726599
H  4.658697 -4.681421 0.711351
H  -0.096791 -3.991114 -0.403788
H  3.041291 -6.525847 1.016752
H  0.65042 -6.183646 0.466476
totalener: -1958.42549188 hartree
nucrepener: 2505.12791735 hartree
electener: -4463.55340923 hartree
oneelecener: -7663.52149469 hartree
twoeener: 3199.96808546 hartree
kineticenergy: 1952.62024197 hartree
xcener: -143.516378854875 hartree
chargesum: 0.0000000
charge: -0.053081 -0.046876 -0.269003 -0.405868 -0.297252 0.070761 0.051477 -0.093693 -0.234925 -0.245651 -0.232190 0.375647 0.039619 0.063479 0.018651 -0.173603 -0.230040 0.271147 -0.068379 -0.227331 0.286612 -0.196349 -0.229212 -0.105995 -0.082001 -0.153064 0.077686 0.086205 0.089853 0.092598 0.073833 0.093581 0.093679 0.091990 0.131087 0.113997 0.101315 0.121586 0.114709 0.124382 0.124766 0.137085 0.122774 0.127828 0.123757 0.124409
qa: -0.0531 -0.0469 -0.2690 -0.4059 -0.2973 0.0708 0.0515 -0.0937 -0.2349 -0.2457 -0.2322 0.3756 0.0396 0.0635 0.0187 -0.1736 -0.2300 0.2711 -0.0684 -0.2273 0.2866 -0.1963 -0.2292 -0.1060 -0.0820 -0.1531 0.0777 0.0862 0.0899 0.0926 0.0738 0.0936 0.0937 0.0920 0.1311 0.1140 0.1013 0.1216 0.1147 0.1244 0.1248 0.1371 0.1228 0.1278 0.1238 0.1244
va: 1.2753 1.2599 2.1353 2.0791 2.1197 3.7713 3.7924 3.8973 3.9123 3.9185 3.8985 4.1333 4.2449 3.8581 3.6865 3.9259 4.0155 3.8313 3.9136 4.0507 3.7730 3.9514 4.0481 3.9422 3.9246 3.9697 1.0349 1.0302 1.0043 1.0043 1.0084 1.0179 1.0027 1.0021 1.0372 0.9887 1.0127 1.0146 1.0172 0.9988 1.0140 1.0039 1.0156 0.9995 0.9990 1.0007
dispcorr: -0.022652487 hartree
energy: -1958.448144364897
dipole: 30.01195 -29.35791 0.65405 2.07831 -1.27658 0.80172 -9.82650 9.69581 -0.13069
magnitude: 1.04289 au
magnitude: 2.65081 debye
