program: Orca
programVersion: 5.0.2
elementType: Cl Cl O O O C C C C C C C C C C C C C C C C C C C C C H H H H H H H H H H H H H H H H H H H H
charge: 0
multiplicity: 1
keywords: wb97x-d3
keywords: def2-TZVPP
keywords: def2/J RIJCOSX
keywords: DEFGRID2
keywords: scfconv7
keywords: smallprint printgap noloewdin
keywords: NOSOSCF
formula: C21H20Cl2O3
InChI: InChI=1/C21H20Cl2O3/c1-21(2)17(12-18(22)23)19(21)20(24)25-13-14-7-6-10-16(11-14)26-15-8-4-3-5-9-15/h3-12,17,19H,13H2,1-2H3
46 atoms
Cl -2.476533 1.196636 2.453919
Cl -2.86144 -0.823045 0.431699
O  1.175735 3.118283 0.040398
O  0.052101 2.27699 -1.697063
O  2.111366 -2.570877 -1.17638
C  -2.240796 4.213829 -1.004882
C  -2.324617 3.196443 0.090093
C  -0.989437 3.87551 -0.239123
C  -2.832115 5.569262 -0.686361
C  -2.430474 3.830046 -2.452857
C  -2.514727 1.760403 -0.173695
C  0.100177 3.013162 -0.750444
C  -2.608852 0.837763 0.774717
C  2.208667 2.161683 -0.173274
C  1.767234 0.7674 0.180741
C  2.144205 -0.296779 -0.623134
C  0.996333 0.532061 1.314386
C  1.750863 -1.588292 -0.303274
C  0.594124 -0.758443 1.616007
C  0.964353 -1.827393 0.81518
C  2.402284 -3.82348 -0.723719
C  1.940163 -4.894429 -1.475475
C  3.18026 -4.041861 0.407426
C  2.263401 -6.187973 -1.095649
C  3.486511 -5.340522 0.781501
C  3.031806 -6.418705 0.035579
H  -2.757374 3.539292 1.023673
H  -0.663613 4.603932 0.494606
H  -2.362899 6.34814 -1.28938
H  -3.901937 5.579982 -0.900706
H  -2.702528 5.840081 0.362522
H  -3.49615 3.812918 -2.687779
H  -1.96432 4.575746 -3.098307
H  -2.003132 2.869527 -2.719492
H  -2.5833 1.414385 -1.195969
H  2.568362 2.200081 -1.203995
H  3.020481 2.488319 0.47797
H  2.7245 -0.130507 -1.522573
H  0.687122 1.351032 1.950572
H  -0.030582 -0.936298 2.480983
H  0.630915 -2.828548 1.053888
H  1.337575 -4.707294 -2.354678
H  3.547507 -3.206573 0.989543
H  1.90376 -7.0204 -1.686381
H  4.092918 -5.507837 1.661904
H  3.277116 -7.42947 0.33212
totalener: -1958.42151694 hartree
nucrepener: 2595.69995321 hartree
electener: -4554.12147015 hartree
oneelecener: -7845.12082846 hartree
twoeener: 3290.99935830 hartree
kineticenergy: 1952.62896629 hartree
xcener: -143.518735431784 hartree
chargesum: 0.0000000
charge: -0.060589 -0.040376 -0.272053 -0.372926 -0.298485 0.107749 -0.045505 -0.065216 -0.236915 -0.266722 -0.162664 0.325919 0.052729 0.065036 0.066084 -0.202907 -0.203736 0.231350 -0.137961 -0.153742 0.246812 -0.209513 -0.165680 -0.092676 -0.116532 -0.144633 0.085657 0.082857 0.092147 0.091884 0.073626 0.091654 0.087162 0.103312 0.120095 0.101607 0.106950 0.103954 0.119883 0.129112 0.130923 0.125458 0.131814 0.124844 0.126044 0.124169
qa: -0.0606 -0.0404 -0.2721 -0.3729 -0.2985 0.1077 -0.0455 -0.0652 -0.2369 -0.2667 -0.1627 0.3259 0.0527 0.0650 0.0661 -0.2029 -0.2037 0.2313 -0.1380 -0.1537 0.2468 -0.2095 -0.1657 -0.0927 -0.1165 -0.1446 0.0857 0.0829 0.0921 0.0919 0.0736 0.0917 0.0872 0.1033 0.1201 0.1016 0.1069 0.1040 0.1199 0.1291 0.1309 0.1255 0.1318 0.1248 0.1260 0.1242
va: 1.2677 1.2669 2.1196 2.1149 2.1072 3.7905 3.8680 3.8403 3.8994 3.9004 3.8941 4.2028 4.2341 3.8608 3.6909 4.0900 3.9215 3.8629 3.8939 3.9429 3.8125 4.0374 3.9429 3.9327 3.9468 3.9605 1.0230 1.0317 1.0051 1.0045 1.0070 0.9988 1.0038 1.0256 1.0248 1.0095 0.9882 1.0257 1.0284 1.0113 1.0042 1.0140 1.0047 0.9989 1.0000 1.0006
dispcorr: -0.025953761 hartree
energy: -1958.447470702493
dipole: 8.60890 -8.59205 0.01685 11.34289 -10.63969 0.70320 -11.46043 11.78770 0.32727
magnitude: 0.77581 au
magnitude: 1.97195 debye
