program: Orca
programVersion: 5.0.2
elementType: Cl Cl O O O C C C C C C C C C C C C C C C C C C C C C H H H H H H H H H H H H H H H H H H H H
charge: 0
multiplicity: 1
keywords: wb97x-d3
keywords: def2-TZVPP
keywords: def2/J RIJCOSX
keywords: DEFGRID2
keywords: scfconv7
keywords: smallprint printgap noloewdin
keywords: NOSOSCF
formula: C21H20Cl2O3
InChI: InChI=1/C21H20Cl2O3/c1-21(2)17(12-18(22)23)19(21)20(24)25-13-14-7-6-10-16(11-14)26-15-8-4-3-5-9-15/h3-12,17,19H,13H2,1-2H3
46 atoms
Cl -5.448029 2.495826 0.293021
Cl -5.12221 -0.360887 0.51075
O  0.942861 2.162335 1.516354
O  -0.1697 0.464794 0.58476
O  4.117005 -2.432115 -0.35428
C  -1.351582 2.73856 -1.224432
C  -2.347875 2.547721 -0.118139
C  -0.873559 2.733178 0.212436
C  -1.343594 4.088836 -1.901884
C  -1.025308 1.604689 -2.164333
C  -3.048976 1.27473 0.095359
C  -0.03312 1.646971 0.763272
C  -4.358827 1.162154 0.276251
C  1.900233 1.246184 2.045469
C  2.830987 0.732825 0.982912
C  3.001395 -0.633135 0.814515
C  3.530552 1.624314 0.176896
C  3.869551 -1.109096 -0.160675
C  4.395382 1.140786 -0.79137
C  4.566961 -0.222228 -0.969339
C  3.175938 -3.378385 -0.065539
C  1.843231 -3.241062 -0.435115
C  3.616658 -4.532201 0.56593
C  0.95539 -4.269275 -0.158866
C  2.719659 -5.556767 0.825542
C  1.385586 -5.429315 0.469345
H  -2.941278 3.424265 0.114842
H  -0.625669 3.707943 0.615683
H  -1.591433 4.896155 -1.211739
H  -0.361409 4.304056 -2.326168
H  -2.071311 4.113856 -2.714573
H  -1.751194 1.589248 -2.978754
H  -0.037147 1.750883 -2.603224
H  -1.031216 0.625955 -1.695016
H  -2.47514 0.358813 0.109402
H  2.447539 1.826112 2.789115
H  1.403988 0.420729 2.560006
H  2.443866 -1.320817 1.437756
H  3.400235 2.691614 0.302917
H  4.941245 1.831025 -1.421054
H  5.237481 -0.605274 -1.727136
H  1.496412 -2.341081 -0.926766
H  4.658906 -4.622249 0.842611
H  -0.08276 -4.160172 -0.443196
H  3.067911 -6.456248 1.315863
H  0.686313 -6.227557 0.677734
totalener: -1958.42549540 hartree
nucrepener: 2497.79250454 hartree
electener: -4456.21799995 hartree
oneelecener: -7648.88356958 hartree
twoeener: 3192.66556964 hartree
kineticenergy: 1952.61908103 hartree
xcener: -143.515720041674 hartree
chargesum: -0.0000000
charge: -0.053117 -0.047274 -0.270242 -0.403151 -0.297867 0.071339 0.050909 -0.096222 -0.234427 -0.246274 -0.231748 0.374892 0.039190 0.064235 0.019656 -0.157114 -0.233396 0.257318 -0.069060 -0.225645 0.267040 -0.183396 -0.219784 -0.105512 -0.087994 -0.148644 0.077794 0.086275 0.073654 0.089848 0.092383 0.093217 0.090957 0.096390 0.131771 0.112589 0.101159 0.117821 0.115236 0.124213 0.124953 0.136121 0.123908 0.128257 0.124645 0.125098
qa: -0.0531 -0.0473 -0.2702 -0.4032 -0.2979 0.0713 0.0509 -0.0962 -0.2344 -0.2463 -0.2317 0.3749 0.0392 0.0642 0.0197 -0.1571 -0.2334 0.2573 -0.0691 -0.2256 0.2670 -0.1834 -0.2198 -0.1055 -0.0880 -0.1486 0.0778 0.0863 0.0737 0.0898 0.0924 0.0932 0.0910 0.0964 0.1318 0.1126 0.1012 0.1178 0.1152 0.1242 0.1250 0.1361 0.1239 0.1283 0.1246 0.1251
va: 1.2753 1.2594 2.1351 2.0829 2.1154 3.7713 3.7925 3.9032 3.9117 3.9180 3.8941 4.1340 4.2437 3.8599 3.7001 3.9169 4.0135 3.8432 3.9181 4.0461 3.7865 3.9573 4.0473 3.9398 3.9268 3.9644 1.0343 1.0302 1.0083 1.0042 1.0043 1.0022 1.0025 1.0181 1.0382 0.9882 1.0130 1.0161 1.0175 0.9987 1.0138 1.0042 1.0146 0.9993 0.9990 1.0005
dispcorr: -0.022484994 hartree
energy: -1958.447980398475
dipole: 29.96949 -29.31146 0.65803 1.98261 -1.23222 0.75039 -9.53084 9.44289 -0.08795
magnitude: 1.00191 au
magnitude: 2.54664 debye
