program: Orca
programVersion: 5.0.2
elementType: Cl Cl O O O C C C C C C C C C C C C C C C C C C C C C H H H H H H H H H H H H H H H H H H H H
charge: 0
multiplicity: 1
keywords: wb97x-d3
keywords: def2-TZVPP
keywords: def2/J RIJCOSX
keywords: DEFGRID2
keywords: scfconv7
keywords: smallprint printgap noloewdin
keywords: NOSOSCF
formula: C21H20Cl2O3
InChI: InChI=1/C21H20Cl2O3/c1-21(2)17(12-18(22)23)19(21)20(24)25-13-14-7-6-10-16(11-14)26-15-8-4-3-5-9-15/h3-12,17,19H,13H2,1-2H3
46 atoms
Cl -1.446785 2.138485 3.098754
Cl -2.610876 -0.358065 2.245788
O  0.972053 2.489131 -1.059632
O  -0.785636 1.329526 -1.806369
O  1.180544 -3.353055 0.034229
C  -2.549024 3.746148 -1.066456
C  -2.1898 3.175861 0.270862
C  -1.099686 3.47123 -0.768306
C  -2.924408 5.211429 -1.073401
C  -3.33218 2.947322 -2.079977
C  -2.494697 1.786263 0.648833
C  -0.336073 2.315938 -1.291449
C  -2.224663 1.262033 1.837231
C  1.799606 1.345151 -1.244239
C  1.530964 0.285246 -0.20899
C  1.496686 -1.048623 -0.584618
C  1.320936 0.631452 1.122635
C  1.272275 -2.033674 0.369798
C  1.072204 -0.356262 2.060565
C  1.056502 -1.693229 1.694882
C  2.083111 -3.898573 -0.829219
C  1.613324 -4.858584 -1.714854
C  3.432149 -3.563621 -0.806564
C  2.497671 -5.484686 -2.579058
C  4.303452 -4.192661 -1.682116
C  3.844387 -5.152701 -2.572165
H  -2.188378 3.874685 1.10007
H  -0.484248 4.334163 -0.540701
H  -3.986168 5.335847 -0.855333
H  -2.365689 5.783826 -0.331667
H  -2.729131 5.655918 -2.050547
H  -4.398683 3.044237 -1.871851
H  -3.155061 3.342073 -3.080813
H  -3.08182 1.892585 -2.107129
H  -2.962396 1.132035 -0.073816
H  1.686548 0.937304 -2.251151
H  2.81725 1.726841 -1.1499
H  1.621803 -1.321324 -1.625717
H  1.330915 1.66943 1.428581
H  0.890383 -0.083943 3.091466
H  0.86394 -2.468983 2.423831
H  0.560847 -5.109715 -1.718071
H  3.80241 -2.823181 -0.109335
H  2.127036 -6.233795 -3.26629
H  5.353218 -3.930748 -1.661359
H  4.530607 -5.639962 -3.251435
totalener: -1958.42169249 hartree
nucrepener: 2604.12941325 hartree
electener: -4562.55110573 hartree
oneelecener: -7861.93434397 hartree
twoeener: 3299.38323824 hartree
kineticenergy: 1952.62773900 hartree
xcener: -143.518176085126 hartree
chargesum: 0.0000000
charge: -0.061061 -0.039600 -0.271474 -0.372905 -0.299499 0.106079 -0.038701 -0.063249 -0.237714 -0.264642 -0.168376 0.322741 0.053303 0.062566 0.056192 -0.146853 -0.211035 0.222343 -0.108958 -0.206443 0.235525 -0.208542 -0.152592 -0.090521 -0.120394 -0.147820 0.085177 0.082910 0.091973 0.073549 0.092344 0.091661 0.087355 0.102330 0.120374 0.101563 0.107008 0.113327 0.119663 0.129316 0.124003 0.125601 0.129407 0.124270 0.125441 0.124358
qa: -0.0611 -0.0396 -0.2715 -0.3729 -0.2995 0.1061 -0.0387 -0.0632 -0.2377 -0.2646 -0.1684 0.3227 0.0533 0.0626 0.0562 -0.1469 -0.2110 0.2223 -0.1090 -0.2064 0.2355 -0.2085 -0.1526 -0.0905 -0.1204 -0.1478 0.0852 0.0829 0.0920 0.0735 0.0923 0.0917 0.0874 0.1023 0.1204 0.1016 0.1070 0.1133 0.1197 0.1293 0.1240 0.1256 0.1294 0.1243 0.1254 0.1244
va: 1.2669 1.2672 2.1192 2.1154 2.1054 3.7964 3.8638 3.8370 3.8995 3.8995 3.8950 4.2083 4.2336 3.8717 3.6756 3.9708 3.9143 3.8420 3.8695 4.0472 3.8283 4.0338 3.9264 3.9355 3.9511 3.9611 1.0239 1.0313 1.0046 1.0069 1.0048 0.9989 1.0037 1.0256 1.0254 1.0107 0.9884 1.0150 1.0272 1.0080 1.0124 1.0140 1.0061 0.9989 1.0001 1.0005
dispcorr: -0.026108990 hartree
energy: -1958.447801475166
dipole: 5.66752 -5.37092 0.29661 7.69879 -6.75980 0.93899 -24.01210 23.58524 -0.42686
magnitude: 1.07326 au
magnitude: 2.72801 debye
