program: Orca
programVersion: 5.0.2
elementType: Cl Cl O O O C C C C C C C C C C C C C C C C C C C C C H H H H H H H H H H H H H H H H H H H H
charge: 0
multiplicity: 1
keywords: wb97x-d3
keywords: def2-TZVPP
keywords: def2/J RIJCOSX
keywords: DEFGRID2
keywords: scfconv7
keywords: smallprint printgap noloewdin
keywords: NOSOSCF
formula: C21H20Cl2O3
InChI: InChI=1/C21H20Cl2O3/c1-21(2)17(12-18(22)23)19(21)20(24)25-13-14-7-6-10-16(11-14)26-15-8-4-3-5-9-15/h3-12,17,19H,13H2,1-2H3
46 atoms
Cl -2.275099 -0.600008 1.373609
Cl -1.660833 -1.380681 -1.337351
O  0.417379 2.720944 -0.848898
O  1.049089 3.581592 1.114705
O  1.761035 -2.366416 -1.019662
C  -2.392627 3.715816 -0.20948
C  -2.303145 2.301725 0.272117
C  -1.255845 3.325434 0.707882
C  -3.457171 4.575717 0.434937
C  -2.174628 4.06868 -1.660972
C  -1.989742 1.175636 -0.622391
C  0.181478 3.231655 0.361251
C  -1.980597 -0.096007 -0.24391
C  1.781276 2.482573 -1.209777
C  2.290268 1.205752 -0.606199
C  1.786984 -0.010437 -1.05769
C  3.234253 1.221568 0.41034
C  2.238154 -1.196203 -0.505816
C  3.687096 0.027282 0.95385
C  3.19626 -1.185146 0.501838
C  1.219163 -3.297616 -0.184319
C  0.579731 -2.964058 1.003135
C  1.286835 -4.621709 -0.596904
C  0.011026 -3.967491 1.772377
C  0.710782 -5.612644 0.181364
C  0.07381 -5.293455 1.371901
H  -2.983305 2.039694 1.075694
H  -1.364682 3.663363 1.731643
H  -3.17997 5.630459 0.397217
H  -4.410288 4.461277 -0.084033
H  -3.616994 4.313535 1.481445
H  -3.116127 3.970332 -2.204396
H  -1.852045 5.107174 -1.750349
H  -1.433003 3.45772 -2.165623
H  -1.780602 1.369829 -1.665226
H  1.76837 2.416596 -2.29744
H  2.408389 3.329513 -0.92757
H  1.042297 -0.045451 -1.843448
H  3.606985 2.16569 0.784272
H  4.429554 0.0409 1.740456
H  3.553218 -2.115719 0.924156
H  0.50869 -1.933323 1.3239
H  1.785193 -4.865424 -1.526185
H  -0.493666 -3.701242 2.691777
H  0.766987 -6.642649 -0.14565
H  -0.373455 -6.069334 1.978106
totalener: -1958.41987775 hartree
nucrepener: 2691.19790016 hartree
electener: -4649.61777792 hartree
oneelecener: -8035.88814041 hartree
twoeener: 3386.27036249 hartree
kineticenergy: 1952.63564234 hartree
xcener: -143.519084854423 hartree
chargesum: -0.0000000
charge: -0.053273 -0.041549 -0.274061 -0.363257 -0.293096 0.084829 0.009046 -0.096161 -0.237947 -0.264584 -0.185861 0.365667 0.059770 0.021972 0.018003 -0.249152 -0.098248 0.218450 -0.118576 -0.139213 0.254774 -0.178058 -0.222566 -0.112906 -0.090053 -0.148624 0.086363 0.088952 0.093545 0.089873 0.075094 0.095564 0.094564 0.088216 0.103179 0.104829 0.110374 0.112337 0.116065 0.126881 0.132040 0.127230 0.122605 0.121440 0.122613 0.122913
qa: -0.0533 -0.0415 -0.2741 -0.3633 -0.2931 0.0848 0.0090 -0.0962 -0.2379 -0.2646 -0.1859 0.3657 0.0598 0.0220 0.0180 -0.2492 -0.0982 0.2185 -0.1186 -0.1392 0.2548 -0.1781 -0.2226 -0.1129 -0.0901 -0.1486 0.0864 0.0890 0.0935 0.0899 0.0751 0.0956 0.0946 0.0882 0.1032 0.1048 0.1104 0.1123 0.1161 0.1269 0.1320 0.1272 0.1226 0.1214 0.1226 0.1229
va: 1.2758 1.2699 2.0944 2.1465 2.0889 3.7933 3.7730 3.8532 3.9073 3.9024 3.8914 4.2193 4.1942 3.8819 3.6716 4.0303 3.9716 3.8857 3.9568 3.9627 3.7489 3.8967 4.0498 3.9745 3.9392 3.9714 1.0256 1.0280 1.0039 1.0039 1.0088 1.0001 1.0033 1.0183 1.0277 0.9980 1.0100 1.0336 1.0203 1.0007 1.0030 1.0165 1.0150 1.0035 0.9988 1.0005
dispcorr: -0.027875281 hartree
energy: -1958.447753032082
dipole: 1.38006 -1.88283 -0.50277 18.34508 -17.77698 0.56810 -0.57863 0.24346 -0.33517
magnitude: 0.82937 au
magnitude: 2.10810 debye
