program: Orca
programVersion: 5.0.2
elementType: Cl Cl O O O C C C C C C C C C C C C C C C C C C C C C H H H H H H H H H H H H H H H H H H H H
charge: 0
multiplicity: 1
keywords: wb97x-d3
keywords: def2-TZVPP
keywords: def2/J RIJCOSX
keywords: DEFGRID2
keywords: scfconv7
keywords: smallprint printgap noloewdin
keywords: NOSOSCF
formula: C21H20Cl2O3
InChI: InChI=1/C21H20Cl2O3/c1-21(2)17(12-18(22)23)19(21)20(24)25-13-14-7-6-10-16(11-14)26-15-8-4-3-5-9-15/h3-12,17,19H,13H2,1-2H3
46 atoms
Cl -5.35332 2.157976 0.20096
Cl -4.869845 -0.67733 0.389427
O  1.143445 2.219941 1.570883
O  -0.005538 0.454937 0.82693
O  3.779791 -2.403252 -0.73877
C  -1.224343 2.698028 -1.037809
C  -2.243155 2.407978 0.027087
C  -0.802914 2.684581 0.418812
C  -1.289457 4.059103 -1.688303
C  -0.777186 1.610728 -1.983444
C  -2.874976 1.08858 0.16923
C  0.11326 1.647172 0.942997
C  -4.185465 0.893609 0.244944
C  2.193493 1.355449 2.010541
C  2.971657 0.80325 0.849613
C  3.009618 -0.56541 0.629937
C  3.627232 1.665236 -0.022777
C  3.684701 -1.07332 -0.472789
C  4.31045 1.149664 -1.112014
C  4.336574 -0.215285 -1.3479
C  2.792114 -3.275315 -0.380999
C  3.197396 -4.532774 0.043658
C  1.440375 -2.968068 -0.48345
C  2.245941 -5.487028 0.367279
C  0.500483 -3.928671 -0.142411
C  0.894172 -5.18893 0.282441
H  -2.902919 3.237194 0.25578
H  -0.632312 3.662638 0.85342
H  -1.98442 4.047766 -2.529523
H  -1.624433 4.830172 -0.993561
H  -0.310254 4.355624 -2.068064
H  -1.47072 1.550207 -2.823471
H  0.211512 1.840478 -2.383773
H  -0.723012 0.62589 -1.528948
H  -2.248036 0.209734 0.214473
H  2.820561 1.98973 2.636993
H  1.79591 0.551232 2.63296
H  2.486559 -1.227446 1.307917
H  3.600581 2.734622 0.144747
H  4.823473 1.815839 -1.792968
H  4.859741 -0.622297 -2.203107
H  4.254012 -4.755929 0.112276
H  1.116191 -1.989085 -0.811933
H  2.566822 -6.467034 0.69508
H  -0.550989 -3.684154 -0.214309
H  0.153557 -5.932472 0.54355
totalener: -1958.42495108 hartree
nucrepener: 2533.23996146 hartree
electener: -4491.66491254 hartree
oneelecener: -7719.77224582 hartree
twoeener: 3228.10733328 hartree
kineticenergy: 1952.62231216 hartree
xcener: -143.516699895440 hartree
chargesum: 0.0000000
charge: -0.053326 -0.048244 -0.265090 -0.407397 -0.297357 0.067254 0.045944 -0.088074 -0.234698 -0.237391 -0.227113 0.370908 0.040530 0.057130 0.015590 -0.168175 -0.230842 0.270319 -0.069244 -0.227211 0.276523 -0.222890 -0.183561 -0.087107 -0.111031 -0.147120 0.077885 0.086976 0.092854 0.073218 0.089678 0.096776 0.092360 0.081957 0.132993 0.114433 0.103462 0.122261 0.114089 0.124929 0.124922 0.122898 0.135784 0.123531 0.126261 0.124407
qa: -0.0533 -0.0482 -0.2651 -0.4074 -0.2974 0.0673 0.0459 -0.0881 -0.2347 -0.2374 -0.2271 0.3709 0.0405 0.0571 0.0156 -0.1682 -0.2308 0.2703 -0.0692 -0.2272 0.2765 -0.2229 -0.1836 -0.0871 -0.1110 -0.1471 0.0779 0.0870 0.0929 0.0732 0.0897 0.0968 0.0924 0.0820 0.1330 0.1144 0.1035 0.1223 0.1141 0.1249 0.1249 0.1229 0.1358 0.1235 0.1263 0.1244
va: 1.2755 1.2584 2.1361 2.0759 2.1208 3.7880 3.7936 3.8863 3.9115 3.9187 3.8929 4.1550 4.2368 3.8596 3.6675 3.9159 4.0137 3.8354 3.9108 4.0503 3.7852 4.0422 3.9480 3.9268 3.9478 3.9651 1.0342 1.0297 1.0041 1.0086 1.0041 1.0036 1.0033 1.0182 1.0341 0.9901 1.0110 1.0159 1.0165 0.9986 1.0138 1.0154 0.9998 0.9991 1.0007 1.0006
dispcorr: -0.023460622 hartree
energy: -1958.448411704241
dipole: 29.20143 -28.50992 0.69151 4.30673 -3.41790 0.88882 -8.52555 8.46071 -0.06483
magnitude: 1.12801 au
magnitude: 2.86717 debye
