program: Orca
programVersion: 5.0.2
elementType: Cl Cl O O O C C C C C C C C C C C C C C C C C C C C C H H H H H H H H H H H H H H H H H H H H
charge: 0
multiplicity: 1
keywords: wb97x-d3
keywords: def2-TZVPP
keywords: def2/J RIJCOSX
keywords: DEFGRID2
keywords: scfconv7
keywords: smallprint printgap noloewdin
keywords: NOSOSCF
formula: C21H20Cl2O3
InChI: InChI=1/C21H20Cl2O3/c1-21(2)17(12-18(22)23)19(21)20(24)25-13-14-7-6-10-16(11-14)26-15-8-4-3-5-9-15/h3-12,17,19H,13H2,1-2H3
46 atoms
Cl -0.576744 0.254327 1.482248
Cl -2.104042 -1.246292 -0.458537
O  1.181134 3.230305 -0.252437
O  -0.324502 2.349149 -1.654794
O  1.513471 -2.210557 -1.181468
C  -2.44062 3.957382 -0.077784
C  -2.26832 2.667541 0.650987
C  -1.04585 3.513472 0.305376
C  -2.976802 5.123001 0.722049
C  -2.896744 3.97342 -1.516271
C  -2.498299 1.363361 -0.005472
C  -0.063792 2.968833 -0.657418
C  -1.82751 0.264028 0.306136
C  2.247758 2.57197 -0.944517
C  2.455108 1.189078 -0.395123
C  1.903796 0.084613 -1.026273
C  3.166481 1.021354 0.789891
C  2.069258 -1.185054 -0.482891
C  3.331911 -0.24525 1.319964
C  2.7928 -1.357502 0.689317
C  1.376252 -3.440867 -0.602132
C  2.032349 -4.513275 -1.185627
C  0.564746 -3.626838 0.510124
C  1.869161 -5.785153 -0.655805
C  0.416987 -4.900703 1.035246
C  1.066811 -5.982909 0.457328
H  -2.507464 2.678307 1.711074
H  -0.597909 4.038168 1.140844
H  -2.646127 5.094562 1.76113
H  -2.647602 6.071705 0.295381
H  -4.068151 5.118597 0.722708
H  -3.987973 3.97661 -1.552955
H  -2.551016 4.8824 -2.010843
H  -2.537518 3.130464 -2.098601
H  -3.252941 1.287747 -0.778049
H  2.061518 2.553671 -2.01886
H  3.123979 3.192918 -0.759927
H  1.327554 0.200605 -1.934957
H  3.593234 1.880286 1.29269
H  3.894881 -0.379834 2.234187
H  2.942274 -2.341211 1.113178
H  2.658795 -4.348199 -2.052431
H  0.051003 -2.784697 0.954911
H  2.378696 -6.622671 -1.113889
H  -0.216232 -5.04734 1.900361
H  0.943735 -6.974978 0.870325
totalener: -1958.42154851 hartree
nucrepener: 2702.16115385 hartree
electener: -4660.58270236 hartree
oneelecener: -8058.46613017 hartree
twoeener: 3397.88342781 hartree
kineticenergy: 1952.63797234 hartree
xcener: -143.520387891375 hartree
chargesum: 0.0000000
charge: -0.049848 -0.042215 -0.259817 -0.388408 -0.285691 0.110534 -0.052505 -0.088706 -0.238340 -0.278315 -0.164598 0.339663 0.092072 0.050030 0.013897 -0.200179 -0.182644 0.237689 -0.123919 -0.163713 0.255243 -0.169247 -0.160126 -0.111024 -0.149078 -0.126025 0.102005 0.081143 0.073200 0.092435 0.088904 0.088901 0.087804 0.109211 0.109383 0.110277 0.104454 0.122860 0.105309 0.124242 0.128202 0.123162 0.107640 0.124266 0.126887 0.124984
qa: -0.0498 -0.0422 -0.2598 -0.3884 -0.2857 0.1105 -0.0525 -0.0887 -0.2383 -0.2783 -0.1646 0.3397 0.0921 0.0500 0.0139 -0.2002 -0.1826 0.2377 -0.1239 -0.1637 0.2552 -0.1692 -0.1601 -0.1110 -0.1491 -0.1260 0.1020 0.0811 0.0732 0.0924 0.0889 0.0889 0.0878 0.1092 0.1094 0.1103 0.1045 0.1229 0.1053 0.1242 0.1282 0.1232 0.1076 0.1243 0.1269 0.1250
va: 1.2940 1.2682 2.1289 2.0840 2.1068 3.7255 3.8883 3.8589 3.9050 3.9013 3.9153 4.1665 4.1894 3.8587 3.6651 3.9391 4.0163 3.8511 3.9796 3.9214 3.7348 4.0394 3.9306 3.9398 4.0122 3.9423 1.0088 1.0351 1.0072 1.0045 1.0047 0.9978 1.0047 1.0181 1.0177 1.0128 0.9941 1.0366 1.0127 1.0009 1.0081 1.0125 1.0420 0.9995 1.0002 1.0000
dispcorr: -0.028128775 hartree
energy: -1958.449677283547
dipole: -0.43032 0.34439 -0.08593 15.76127 -15.16493 0.59634 -0.79168 1.47321 0.68153
magnitude: 0.90966 au
magnitude: 2.31218 debye
