program: Orca
programVersion: 5.0.2
elementType: Cl Cl O O O C C C C C C C C C C C C C C C C C C C C C H H H H H H H H H H H H H H H H H H H H
charge: 0
multiplicity: 1
keywords: wb97x-d3
keywords: def2-TZVPP
keywords: def2/J RIJCOSX
keywords: DEFGRID2
keywords: scfconv7
keywords: smallprint printgap noloewdin
keywords: NOSOSCF
formula: C21H20Cl2O3
InChI: InChI=1/C21H20Cl2O3/c1-21(2)17(12-18(22)23)19(21)20(24)25-13-14-7-6-10-16(11-14)26-15-8-4-3-5-9-15/h3-12,17,19H,13H2,1-2H3
46 atoms
Cl -1.682815 -1.267841 -0.588365
Cl -2.875436 -0.537261 -3.120781
O  0.98873 2.260317 0.276125
O  -0.438818 2.713147 -1.395284
O  2.609746 -2.546891 0.187235
C  -2.58034 2.919038 0.841971
C  -2.561717 1.500206 0.385029
C  -1.257782 2.184184 0.79037
C  -3.113468 3.172378 2.233494
C  -2.89415 4.039664 -0.118662
C  -2.823485 1.11574 -1.015637
C  -0.231939 2.430897 -0.245657
C  -2.507033 -0.073328 -1.509074
C  2.121554 2.27079 -0.58652
C  2.966798 1.066287 -0.286884
C  2.370145 -0.183812 -0.174493
C  4.343356 1.185334 -0.150127
C  3.15015 -1.298579 0.093503
C  5.117624 0.060119 0.093836
C  4.52714 -1.184775 0.228747
C  1.451908 -2.737985 0.881922
C  0.578135 -3.702607 0.399968
C  1.160214 -2.047724 2.052678
C  -0.586749 -3.98213 1.09746
C  -0.013858 -2.330149 2.733234
C  -0.892347 -3.295117 2.263178
H  -2.887299 0.761398 1.111354
H  -0.851433 1.874808 1.745874
H  -2.886463 2.351953 2.91555
H  -2.684932 4.082795 2.655392
H  -4.197942 3.292846 2.211631
H  -2.506835 3.881252 -1.120774
H  -3.975827 4.172096 -0.186528
H  -2.473085 4.976884 0.248587
H  -3.315825 1.816375 -1.676989
H  1.805468 2.274589 -1.631568
H  2.684266 3.190217 -0.408021
H  1.29843 -0.294538 -0.29108
H  4.813631 2.157702 -0.229247
H  6.189821 0.156781 0.201192
H  5.120345 -2.065245 0.437292
H  0.817363 -4.228598 -0.514762
H  1.841288 -1.298418 2.434622
H  -1.264453 -4.735095 0.717599
H  -0.236765 -1.792294 3.645518
H  -1.805593 -3.511078 2.800617
totalener: -1958.42232444 hartree
nucrepener: 2668.85654780 hartree
electener: -4627.27887224 hartree
oneelecener: -7991.24170981 hartree
twoeener: 3363.96283756 hartree
kineticenergy: 1952.62336102 hartree
xcener: -143.517894621212 hartree
chargesum: 0.0000000
charge: -0.047728 -0.047216 -0.270167 -0.383456 -0.298081 0.104072 -0.058495 -0.062471 -0.232768 -0.279361 -0.141605 0.335630 0.058237 0.038751 0.022621 -0.122865 -0.174892 0.224035 -0.083421 -0.211850 0.247734 -0.204664 -0.145330 -0.124462 -0.121298 -0.131203 0.097605 0.081157 0.072579 0.091821 0.090233 0.104357 0.093581 0.087770 0.107446 0.120454 0.091154 0.090865 0.107663 0.124442 0.126325 0.122632 0.129004 0.124732 0.123841 0.122594
qa: -0.0477 -0.0472 -0.2702 -0.3835 -0.2981 0.1041 -0.0585 -0.0625 -0.2328 -0.2794 -0.1416 0.3356 0.0582 0.0388 0.0226 -0.1229 -0.1749 0.2240 -0.0834 -0.2119 0.2477 -0.2047 -0.1453 -0.1245 -0.1213 -0.1312 0.0976 0.0812 0.0726 0.0918 0.0902 0.1044 0.0936 0.0878 0.1074 0.1205 0.0912 0.0909 0.1077 0.1244 0.1263 0.1226 0.1290 0.1247 0.1238 0.1226
va: 1.3096 1.2612 2.1271 2.1005 2.1084 3.7892 3.8835 3.8407 3.8977 3.9061 3.8569 4.1631 4.2154 3.8642 3.7626 3.9265 3.9941 3.8237 3.9521 4.0382 3.7827 3.9768 3.9164 3.9057 3.9337 3.9186 1.0124 1.0333 1.0074 1.0049 1.0047 1.0199 0.9979 1.0042 1.0206 1.0136 1.0003 1.0299 1.0127 0.9996 1.0124 1.0164 1.0054 1.0016 1.0002 1.0011
dispcorr: -0.026105967 hartree
energy: -1958.448430409444
dipole: 2.57194 -2.66615 -0.09420 18.24808 -17.59186 0.65622 19.55328 -18.47846 1.07482
magnitude: 1.26283 au
magnitude: 3.20985 debye
