program: Orca
programVersion: 5.0.2
elementType: Cl Cl O O O C C C C C C C C C C C C C C C C C C C C C H H H H H H H H H H H H H H H H H H H H
charge: 0
multiplicity: 1
keywords: wb97x-d3
keywords: def2-TZVPP
keywords: def2/J RIJCOSX
keywords: DEFGRID2
keywords: scfconv7
keywords: smallprint printgap noloewdin
keywords: NOSOSCF
formula: C21H20Cl2O3
InChI: InChI=1/C21H20Cl2O3/c1-21(2)17(12-18(22)23)19(21)20(24)25-13-14-7-6-10-16(11-14)26-15-8-4-3-5-9-15/h3-12,17,19H,13H2,1-2H3
46 atoms
Cl -5.129665 2.669488 -0.902846
Cl -3.69035 4.640499 0.627842
O  0.926776 0.647441 -1.957799
O  0.399934 1.86983 -0.165334
O  3.782818 -2.856991 0.472199
C  -1.920829 -0.21572 0.09087
C  -2.51814 0.954762 -0.63404
C  -1.204489 0.353851 -1.116254
C  -2.578394 -1.558664 -0.123881
C  -1.359933 -0.051327 1.481396
C  -2.597805 2.295585 -0.04002
C  0.091417 1.05581 -0.994871
C  -3.66377 3.084001 -0.101104
C  2.259159 1.145556 -1.902571
C  3.063815 0.489691 -0.814726
C  3.016031 -0.889405 -0.654775
C  3.888013 1.246128 0.008211
C  3.787841 -1.498427 0.323367
C  4.670711 0.62616 0.969653
C  4.621301 -0.748592 1.138894
C  2.603938 -3.492912 0.722208
C  1.567407 -2.901031 1.434571
C  2.486471 -4.800736 0.269598
C  0.416181 -3.631198 1.690203
C  1.330402 -5.516661 0.533802
C  0.287126 -4.936605 1.241052
H  -3.350539 0.708039 -1.28278
H  -1.287112 -0.23823 -2.019945
H  -3.380785 -1.711995 0.59952
H  -3.012451 -1.647974 -1.120276
H  -1.854955 -2.36687 -0.002093
H  -0.890778 0.910471 1.662195
H  -2.160776 -0.176133 2.211792
H  -0.610839 -0.820232 1.674662
H  -1.737305 2.685174 0.485257
H  2.67984 0.910558 -2.881135
H  2.266505 2.231174 -1.785632
H  2.378737 -1.494788 -1.288773
H  3.912168 2.323234 -0.097048
H  5.311978 1.219755 1.607478
H  5.220677 -1.241103 1.89306
H  1.658599 -1.88513 1.797596
H  3.302446 -5.247905 -0.282688
H  -0.385175 -3.172692 2.255417
H  1.243838 -6.534761 0.177806
H  -0.614183 -5.498027 1.445908
totalener: -1958.42508583 hartree
nucrepener: 2546.54278620 hartree
electener: -4504.96787204 hartree
oneelecener: -7746.07215568 hartree
twoeener: 3241.10428364 hartree
kineticenergy: 1952.62580482 hartree
xcener: -143.517512015595 hartree
chargesum: 0.0000000
charge: -0.052891 -0.046771 -0.274638 -0.390832 -0.301563 0.094534 0.048624 -0.071168 -0.244124 -0.248793 -0.234661 0.348962 0.038288 0.072182 0.038982 -0.198952 -0.148123 0.200670 -0.094751 -0.192489 0.221996 -0.113491 -0.200686 -0.183232 -0.093284 -0.139764 0.076545 0.086168 0.091894 0.074957 0.093813 0.108454 0.098647 0.050734 0.129041 0.110454 0.102915 0.125327 0.107955 0.125815 0.128248 0.136913 0.125632 0.140929 0.125204 0.126331
qa: -0.0529 -0.0468 -0.2746 -0.3908 -0.3016 0.0945 0.0486 -0.0712 -0.2441 -0.2488 -0.2347 0.3490 0.0383 0.0722 0.0390 -0.1990 -0.1481 0.2007 -0.0948 -0.1925 0.2220 -0.1135 -0.2007 -0.1832 -0.0933 -0.1398 0.0765 0.0862 0.0919 0.0750 0.0938 0.1085 0.0986 0.0507 0.1290 0.1105 0.1029 0.1253 0.1080 0.1258 0.1282 0.1369 0.1256 0.1409 0.1252 0.1263
va: 1.2759 1.2601 2.1275 2.0943 2.1013 3.7288 3.8105 3.8835 3.9157 3.9095 3.9000 4.1555 4.2481 3.8580 3.6759 3.9661 4.0078 3.8458 3.9400 4.0418 3.8536 3.8507 4.0211 3.9339 3.9526 3.9552 1.0360 1.0304 1.0027 1.0112 1.0052 1.0238 1.0023 1.0236 1.0394 0.9883 1.0122 1.0219 1.0127 0.9997 1.0104 1.0018 1.0136 0.9896 0.9980 1.0006
dispcorr: -0.024825763 hartree
energy: -1958.449911595327
dipole: 20.19140 -19.82930 0.36210 -29.74506 28.87915 -0.86590 4.62024 -4.90945 -0.28921
magnitude: 0.98211 au
magnitude: 2.49634 debye
