program: Orca
programVersion: 5.0.3
elementType: Cl Cl Cl O O C C C C C C C C C C C C C C C C H H H H H H H H H H H H H H H
charge: 0
multiplicity: 1
keywords: wb97x-d3
keywords: def2-TZVPP
keywords: def2/J RIJCOSX
keywords: DEFGRID2
keywords: scfconv7
keywords: smallprint printgap noloewdin
keywords: NOSOSCF
formula: C16H15Cl3O2
InChI: InChI=1/C16H15Cl3O2/c1-20-13-7-3-11(4-8-13)15(16(17,18)19)12-5-9-14(21-2)10-6-12/h3-10,15H,1-2H3
36 atoms
Cl -1.53187 -2.870729 0.472094
Cl -0.073305 -1.926622 -1.808826
Cl 1.337943 -2.969205 0.457383
O  -4.725601 2.513416 0.266773
O  4.895733 2.167839 0.19807
C  -0.018057 -0.626189 0.653254
C  -1.267567 0.207001 0.452541
C  1.282855 0.118716 0.43638
C  -0.068169 -2.003182 -0.038836
C  -1.650255 0.786228 -0.751516
C  1.68018 0.683593 -0.76955
C  -2.081212 0.439767 1.562439
C  2.134964 0.277378 1.530314
C  -2.800264 1.558885 -0.855347
C  2.880669 1.372509 -0.890941
C  -3.222494 1.212312 1.48152
C  3.327273 0.966326 1.432071
C  -3.598194 1.778271 0.263775
C  3.716954 1.518352 0.212271
C  -5.150022 3.105226 -0.944633
C  5.336088 2.744311 -1.014964
H  -0.021845 -0.904462 1.710929
H  -1.064897 0.655862 -1.649572
H  1.066618 0.607342 -1.654996
H  -1.814534 0.010515 2.520758
H  1.858483 -0.143705 2.48954
H  -3.050374 1.982098 -1.818715
H  3.139692 1.788295 -1.855182
H  -3.830647 1.378729 2.361879
H  3.96491 1.077374 2.300222
H  -4.41691 3.817233 -1.3332
H  -6.068776 3.642828 -0.719595
H  -5.363672 2.35829 -1.714014
H  5.479297 1.99486 -1.798179
H  6.295558 3.2117 -0.803529
H  4.648242 3.512372 -1.378677
elementType: Cl O C H
totalener: -2149.86334385 hartree
nucrepener: 2097.32880439 hartree
electener: -4247.19214824 hartree
oneelecener: -7125.26280095 hartree
twoeener: 2878.07065271 hartree
cpcmener: -0.02179999 hartree
kineticenergy: 2144.52036733 hartree
xcener: -138.569210805656 hartree
chargesum: 0.0000000
charge: -0.057397 -0.055092 -0.057220 -0.325338 -0.325393 0.029841 0.029350 0.031728 0.127945 -0.234827 -0.236602 -0.132350 -0.133088 -0.239589 -0.239697 -0.222846 -0.222935 0.311034 0.311083 -0.120653 -0.120580 0.107232 0.136265 0.136229 0.132997 0.133050 0.137818 0.138584 0.136473 0.136490 0.110550 0.122187 0.111074 0.110882 0.122366 0.110430
qa: -0.0574 -0.0551 -0.0572 -0.3253 -0.3254 0.0298 0.0293 0.0317 0.1279 -0.2348 -0.2366 -0.1323 -0.1331 -0.2396 -0.2397 -0.2228 -0.2229 0.3110 0.3111 -0.1207 -0.1206 0.1072 0.1363 0.1362 0.1330 0.1330 0.1378 0.1386 0.1365 0.1365 0.1105 0.1222 0.1111 0.1109 0.1224 0.1104
va: 1.2452 1.2499 1.2452 2.0741 2.0740 3.7225 3.5300 3.5290 4.4864 4.0686 4.0689 3.9910 3.9912 3.9681 3.9671 3.9955 3.9957 3.7886 3.7886 3.8647 3.8648 1.0546 1.0176 1.0169 1.0046 1.0049 1.0140 1.0137 1.0117 1.0117 0.9871 0.9943 0.9871 0.9872 0.9943 0.9871
dispcorr: -0.018677702 hartree
energy: -2149.882021554595
dipole: 1.12826 -1.08887 0.03938 34.09635 -32.57764 1.51871 -2.12427 1.16259 -0.96168
magnitude: 1.79802 au
magnitude: 4.57019 debye
