program: Orca
programVersion: 5.0.2
elementType: S O O O O C C C C C C C C C C C C C C C C C C C C C C C H H H H H H H H H H H H H H H H H H H H H H H H
charge: 0
multiplicity: 1
keywords: wb97x-d3
keywords: def2-TZVPP
keywords: def2/J RIJCOSX
keywords: DEFGRID2
keywords: scfconv7
keywords: smallprint printgap noloewdin
keywords: NOSOSCF
formula: C23H24O4S
InChI: InChI=1/C23H24O4S/c1-23(2)19(12-17-8-9-28-22(17)25)20(23)21(24)27-14-16-11-18(26-13-16)10-15-6-4-3-5-7-15/h3-7,11-13,19-20H,8-10,14H2,1-2H3
52 atoms
S  -1.146584 -3.077636 0.169784
O  2.540904 2.340316 -1.147417
O  2.731396 1.904551 1.034583
O  0.047608 -1.815726 2.139153
O  -1.218899 0.53295 -0.637261
C  4.734987 -0.342827 0.261752
C  3.456747 -0.857556 -0.352899
C  3.931876 0.591416 -0.586494
C  4.880712 -0.187939 1.756069
C  6.006589 -0.838887 -0.38813
C  2.262099 -1.128234 0.447955
C  3.042045 1.66805 -0.108703
C  1.249275 -1.910392 0.05298
C  1.093711 -2.63445 -1.247822
C  0.124475 -2.153815 0.978664
C  -0.397698 -2.877577 -1.475499
C  1.358621 3.119558 -0.903815
C  0.214871 2.224279 -0.562856
C  -0.619783 2.266153 0.598872
C  -0.199292 1.148456 -1.273924
C  -1.474391 1.220214 0.50205
C  -2.588366 0.735374 1.356533
C  -3.893013 0.68427 0.599791
C  -4.371796 -0.518304 0.091474
C  -4.618283 1.850023 0.365437
C  -5.557485 -0.559158 -0.631534
C  -5.801977 1.812824 -0.357297
C  -6.275549 0.606361 -0.858517
H  3.571927 -1.482467 -1.230781
H  4.303784 0.754698 -1.591418
H  3.988433 0.152091 2.271149
H  5.168077 -1.146864 2.189502
H  5.677233 0.523767 1.978046
H  5.891139 -0.970918 -1.464461
H  6.82238 -0.133082 -0.223674
H  6.302689 -1.798648 0.037857
H  2.192813 -0.68214 1.433055
H  1.616809 -3.593496 -1.203168
H  1.509199 -2.075992 -2.086618
H  -0.584185 -3.773545 -2.062517
H  -0.873606 -2.033179 -1.971145
H  1.526543 3.860807 -0.121337
H  1.191198 3.655072 -1.83705
H  -0.58452 2.989072 1.39875
H  0.129401 0.708334 -2.20253
H  -2.355269 -0.255402 1.756619
H  -2.668555 1.409617 2.210379
H  -3.813623 -1.43122 0.264993
H  -4.253264 2.794078 0.753205
H  -5.918854 -1.502926 -1.01921
H  -6.356722 2.72634 -0.528784
H  -7.199086 0.576422 -1.421999
elementType: S O C H
totalener: -1590.09419428 hartree
nucrepener: 2831.37836188 hartree
electener: -4421.47255615 hartree
oneelecener: -7804.35052021 hartree
twoeener: 3382.87796406 hartree
cpcmener: -0.04631968 hartree
kineticenergy: 1584.21369461 hartree
xcener: -135.009354966905 hartree
chargesum: 0.0000000
charge: -0.067330 -0.289003 -0.472046 -0.464430 -0.277338 0.109410 0.025404 -0.073903 -0.280631 -0.261756 -0.134288 0.378649 -0.133568 -0.150767 0.298828 -0.112141 0.096001 -0.032416 -0.324167 -0.067484 0.183362 -0.062922 0.060879 -0.188949 -0.199580 -0.179836 -0.162206 -0.167613 0.112692 0.104445 0.096014 0.098654 0.101862 0.090624 0.097666 0.097534 0.124014 0.115189 0.096963 0.129815 0.111784 0.119072 0.123301 0.162956 0.172735 0.105594 0.119493 0.147275 0.143575 0.157802 0.160063 0.160717
qa: -0.0673 -0.2890 -0.4720 -0.4644 -0.2773 0.1094 0.0254 -0.0739 -0.2806 -0.2618 -0.1343 0.3786 -0.1336 -0.1508 0.2988 -0.1121 0.0960 -0.0324 -0.3242 -0.0675 0.1834 -0.0629 0.0609 -0.1889 -0.1996 -0.1798 -0.1622 -0.1676 0.1127 0.1044 0.0960 0.0987 0.1019 0.0906 0.0977 0.0975 0.1240 0.1152 0.0970 0.1298 0.1118 0.1191 0.1233 0.1630 0.1727 0.1056 0.1195 0.1473 0.1436 0.1578 0.1601 0.1607
va: 2.4268 2.1088 2.0192 2.0135 2.2403 3.7838 3.7668 3.8373 3.8820 3.8997 3.8180 4.1867 3.5893 3.9997 4.1538 3.9246 3.8191 3.6011 4.0137 3.9205 3.5987 3.8092 3.5332 3.9159 3.9491 3.9406 3.8929 3.8895 1.0053 1.0293 1.0173 1.0005 0.9987 1.0042 1.0023 1.0021 1.0348 1.0015 1.0066 1.0118 1.0107 1.0052 0.9945 1.0055 0.9963 1.0136 1.0101 1.0091 1.0029 0.9918 0.9899 0.9891
dispcorr: -0.030826231 hartree
energy: -1590.125020508436
dipole: 14.26675 -12.81479 1.45196 -0.26971 0.12788 -0.14183 -4.48661 1.34222 -3.14439
magnitude: 3.46634 au
magnitude: 8.81073 debye
