program: Orca
programVersion: 5.0.2
elementType: S O O O O C C C C C C C C C C C C C C C C C C C C C C C H H H H H H H H H H H H H H H H H H H H H H H H
charge: 0
multiplicity: 1
keywords: wb97x-d3
keywords: def2-TZVPP
keywords: def2/J RIJCOSX
keywords: DEFGRID2
keywords: scfconv7
keywords: smallprint printgap noloewdin
keywords: NOSOSCF
formula: C23H24O4S
InChI: InChI=1/C23H24O4S/c1-23(2)19(12-17-8-9-28-22(17)25)20(23)21(24)27-14-16-11-18(26-13-16)10-15-6-4-3-5-7-15/h3-7,11-13,19-20H,8-10,14H2,1-2H3
52 atoms
S  -1.350318 -2.601444 0.090229
O  2.525206 2.291648 0.222868
O  2.026331 0.428359 1.355707
O  0.704957 -4.146181 0.632835
O  -1.475339 2.458357 -1.021634
C  4.649158 -0.616201 -0.085828
C  3.480193 -1.120548 -0.854388
C  3.554049 0.357246 -0.498137
C  4.818859 -1.006928 1.360391
C  5.959097 -0.452686 -0.816773
C  2.508223 -2.067184 -0.265538
C  2.628009 0.979671 0.463393
C  1.194417 -2.072192 -0.496846
C  0.383843 -1.109596 -1.300752
C  0.340739 -3.10223 0.139147
C  -0.958671 -0.956967 -0.589627
C  1.554819 3.030705 0.96555
C  0.190059 2.830224 0.39956
C  -1.054487 2.931403 1.099138
C  -0.12943 2.544378 -0.883811
C  -2.030721 2.699534 0.189643
C  -3.508817 2.598938 0.2939
C  -3.968647 1.171786 0.117248
C  -3.895105 0.278657 1.18335
C  -4.41079 0.709431 -1.117485
C  -4.255785 -1.050178 1.01924
C  -4.772119 -0.622229 -1.285548
C  -4.693236 -1.50576 -0.218796
H  3.646931 -1.289382 -1.915658
H  3.818388 1.007685 -1.323045
H  5.366006 -0.234087 1.902387
H  3.883179 -1.182348 1.885629
H  5.403307 -1.9264 1.421901
H  5.811357 -0.174307 -1.860781
H  6.573545 0.317408 -0.347686
H  6.523984 -1.386496 -0.797249
H  2.917562 -2.843685 0.374438
H  0.221065 -1.516418 -2.302853
H  0.867378 -0.141206 -1.423945
H  -1.758563 -0.655382 -1.261574
H  -0.897082 -0.245067 0.232913
H  1.581088 2.77119 2.02505
H  1.867392 4.071689 0.879164
H  -1.196917 3.142587 2.147378
H  0.457496 2.38366 -1.774092
H  -3.801639 2.973676 1.275475
H  -3.985357 3.242301 -0.45003
H  -3.547227 0.62744 2.148862
H  -4.474328 1.393957 -1.954937
H  -4.192859 -1.732371 1.856755
H  -5.113392 -0.969007 -2.252394
H  -4.970732 -2.543565 -0.348581
elementType: S O C H
totalener: -1590.09537425 hartree
nucrepener: 2850.47578792 hartree
electener: -4440.57116216 hartree
oneelecener: -7841.70850864 hartree
twoeener: 3401.13734648 hartree
cpcmener: -0.04425460 hartree
kineticenergy: 1584.21288590 hartree
xcener: -135.013000247737 hartree
chargesum: -0.0000000
charge: -0.056569 -0.293082 -0.482757 -0.458266 -0.285256 0.122120 -0.030314 -0.098885 -0.294683 -0.263033 -0.126989 0.384565 -0.082624 -0.120634 0.272741 -0.115260 0.115217 -0.024143 -0.328048 -0.083889 0.180312 -0.050938 0.042795 -0.179951 -0.188581 -0.175110 -0.141584 -0.174928 0.119904 0.099797 0.103793 0.097488 0.102948 0.089889 0.097261 0.095729 0.132634 0.117983 0.085594 0.134840 0.104073 0.115214 0.120838 0.163069 0.176345 0.113438 0.113024 0.141349 0.140016 0.156083 0.157815 0.158649
qa: -0.0566 -0.2931 -0.4828 -0.4583 -0.2853 0.1221 -0.0303 -0.0989 -0.2947 -0.2630 -0.1270 0.3846 -0.0826 -0.1206 0.2727 -0.1153 0.1152 -0.0241 -0.3280 -0.0839 0.1803 -0.0509 0.0428 -0.1800 -0.1886 -0.1751 -0.1416 -0.1749 0.1199 0.0998 0.1038 0.0975 0.1029 0.0899 0.0973 0.0957 0.1326 0.1180 0.0856 0.1348 0.1041 0.1152 0.1208 0.1631 0.1763 0.1134 0.1130 0.1413 0.1400 0.1561 0.1578 0.1586
va: 2.4671 2.1229 1.9973 2.0247 2.2477 3.7470 3.8833 3.8740 3.9036 3.9014 3.8696 4.0814 3.5467 4.0305 4.2200 3.8946 3.8059 3.5795 3.9952 3.9082 3.6344 3.8169 3.5663 3.8540 3.9157 3.8212 3.8676 3.8134 1.0053 1.0307 1.0003 1.0134 0.9986 1.0046 1.0017 1.0017 1.0121 1.0078 1.0192 1.0164 1.0218 1.0151 0.9917 1.0043 0.9957 1.0096 1.0074 1.0035 1.0060 0.9972 0.9900 0.9929
dispcorr: -0.032673523 hartree
energy: -1590.128047771890
dipole: 13.98048 -13.11264 0.86783 5.34050 -2.25005 3.09045 -2.06489 0.55605 -1.50884
magnitude: 3.54692 au
magnitude: 9.01555 debye
