program: Orca
programVersion: 5.0.2
elementType: S O O O O C C C C C C C C C C C C C C C C C C C C C C C H H H H H H H H H H H H H H H H H H H H H H H H
charge: 0
multiplicity: 1
keywords: wb97x-d3
keywords: def2-TZVPP
keywords: def2/J RIJCOSX
keywords: DEFGRID2
keywords: scfconv7
keywords: smallprint printgap noloewdin
keywords: NOSOSCF
formula: C23H24O4S
InChI: InChI=1/C23H24O4S/c1-23(2)19(12-17-8-9-28-22(17)25)20(23)21(24)27-14-16-11-18(26-13-16)10-15-6-4-3-5-7-15/h3-7,11-13,19-20H,8-10,14H2,1-2H3
52 atoms
S  -1.402233 -2.109194 0.992566
O  2.255129 2.151999 -0.722507
O  2.860135 1.010698 1.098402
O  0.742419 -2.732275 2.375272
O  -1.51787 1.605543 1.494616
C  4.629868 -0.716764 -0.740153
C  3.259014 -1.279655 -0.884303
C  3.49335 0.226547 -1.075288
C  5.335773 -0.687358 0.592903
C  5.576242 -0.971862 -1.890734
C  2.438087 -1.734556 0.252768
C  2.868232 1.143384 -0.104634
C  1.115017 -1.889059 0.151761
C  0.277597 -1.648288 -1.06253
C  0.319245 -2.310175 1.321532
C  -1.131247 -1.280102 -0.602821
C  1.537571 3.092777 0.09718
C  0.176939 2.607556 0.467546
C  -1.050619 2.982667 -0.169732
C  -0.176013 1.762789 1.468638
C  -2.047365 2.352298 0.493488
C  -3.520732 2.30683 0.304907
C  -3.974277 1.001088 -0.304039
C  -4.315939 -0.082187 0.499487
C  -4.016249 0.850622 -1.68788
C  -4.698102 -1.291529 -0.068161
C  -4.399587 -0.35513 -2.258014
C  -4.741751 -1.431171 -1.448513
H  3.041289 -1.783859 -1.821185
H  3.450418 0.567499 -2.102622
H  4.678129 -0.609212 1.452854
H  5.917607 -1.60345 0.707503
H  6.034112 0.149872 0.632321
H  6.342257 -0.196397 -1.942044
H  6.080382 -1.9310 -1.761769
H  5.057273 -0.994283 -2.849621
H  2.922006 -1.941858 1.20102
H  0.2428 -2.556875 -1.669581
H  0.681242 -0.854111 -1.691102
H  -1.893749 -1.607431 -1.304834
H  -1.233765 -0.207479 -0.459244
H  2.12721 3.3521 0.976161
H  1.454216 3.984442 -0.520789
H  -1.165469 3.648654 -1.010793
H  0.381888 1.231913 2.222969
H  -4.02428 2.469153 1.261252
H  -3.797866 3.13679 -0.345925
H  -4.289425 0.019396 1.577815
H  -3.750896 1.686819 -2.324345
H  -4.962464 -2.124896 0.569883
H  -4.432729 -0.454205 -3.335446
H  -5.041371 -2.371936 -1.891832
elementType: S O C H
totalener: -1590.09580206 hartree
nucrepener: 2865.10207833 hartree
electener: -4455.19788038 hartree
oneelecener: -7871.00198675 hartree
twoeener: 3415.80410637 hartree
cpcmener: -0.04291880 hartree
kineticenergy: 1584.21920747 hartree
xcener: -135.012982707803 hartree
chargesum: -0.0000000
charge: -0.059305 -0.291353 -0.492746 -0.462416 -0.278753 0.120867 -0.060848 -0.069312 -0.285565 -0.261371 -0.107607 0.403996 -0.105568 -0.133682 0.281643 -0.100766 0.089062 -0.054266 -0.308917 -0.046323 0.177386 -0.056574 0.051783 -0.186076 -0.198334 -0.171176 -0.153495 -0.161864 0.122257 0.096691 0.090964 0.099341 0.104146 0.098331 0.096052 0.090272 0.130257 0.116372 0.100057 0.136956 0.084243 0.123064 0.119885 0.163821 0.166486 0.115830 0.113475 0.136809 0.141339 0.158139 0.158723 0.158071
qa: -0.0593 -0.2914 -0.4927 -0.4624 -0.2788 0.1209 -0.0608 -0.0693 -0.2856 -0.2614 -0.1076 0.4040 -0.1056 -0.1337 0.2816 -0.1008 0.0891 -0.0543 -0.3089 -0.0463 0.1774 -0.0566 0.0518 -0.1861 -0.1983 -0.1712 -0.1535 -0.1619 0.1223 0.0967 0.0910 0.0993 0.1041 0.0983 0.0961 0.0903 0.1303 0.1164 0.1001 0.1370 0.0842 0.1231 0.1199 0.1638 0.1665 0.1158 0.1135 0.1368 0.1413 0.1581 0.1587 0.1581
va: 2.4565 2.1216 1.9904 2.0228 2.2632 3.7959 3.8516 3.8688 3.8876 3.8986 3.8301 4.0831 3.5599 4.0498 4.2037 3.9241 3.8056 3.5809 4.0083 3.9229 3.6256 3.8080 3.5421 3.8537 3.9156 3.8140 3.8638 3.8488 1.0051 1.0298 1.0194 0.9997 0.9991 1.0018 1.0026 1.0035 1.0217 1.0044 1.0047 1.0139 1.0142 1.0089 0.9968 1.0045 1.0096 1.0081 1.0089 1.0127 1.0043 0.9932 0.9903 0.9907
dispcorr: -0.032674548 hartree
energy: -1590.128476603994
dipole: 12.96500 -12.85348 0.11152 1.16440 0.41297 1.57737 -13.80874 10.17076 -3.63799
magnitude: 3.96680 au
magnitude: 10.08280 debye
