program: Orca
programVersion: 5.0.2
elementType: S O O O O C C C C C C C C C C C C C C C C C C C C C C C H H H H H H H H H H H H H H H H H H H H H H H H
charge: 0
multiplicity: 1
keywords: wb97x-d3
keywords: def2-TZVPP
keywords: def2/J RIJCOSX
keywords: DEFGRID2
keywords: scfconv7
keywords: smallprint printgap noloewdin
keywords: NOSOSCF
formula: C23H24O4S
InChI: InChI=1/C23H24O4S/c1-23(2)19(12-17-8-9-28-22(17)25)20(23)21(24)27-14-16-11-18(26-13-16)10-15-6-4-3-5-7-15/h3-7,11-13,19-20H,8-10,14H2,1-2H3
52 atoms
S  -1.618055 -3.269963 1.216338
O  2.681197 1.836856 0.456615
O  2.287224 2.653492 -1.5802
O  -0.189841 -1.453859 2.444334
O  -1.489628 3.179791 0.379071
C  3.834058 -0.670169 -0.816204
C  2.356543 -0.910499 -1.017608
C  3.001623 0.422104 -1.427019
C  4.425118 -0.593496 0.570789
C  4.749512 -1.377448 -1.788761
C  1.441739 -1.045976 0.113519
C  2.62358 1.736577 -0.862815
C  0.460057 -1.95662 0.177541
C  0.097338 -2.988623 -0.845858
C  -0.348718 -2.06163 1.40723
C  -1.319402 -3.491121 -0.562509
C  2.101668 3.006941 1.071424
C  0.621361 2.913662 1.008875
C  -0.179451 1.896727 1.619515
C  -0.230198 3.659132 0.268714
C  -1.447433 2.091878 1.196016
C  -2.683473 1.290334 1.344459
C  -3.05372 0.511969 0.097643
C  -4.333275 -0.030754 -0.008607
C  -2.151755 0.293398 -0.940577
C  -4.702323 -0.774663 -1.120147
C  -2.523577 -0.439742 -2.061533
C  -3.798832 -0.978051 -2.156166
H  2.108992 -1.524248 -1.876154
H  3.101053 0.506021 -2.503116
H  5.32841 0.01892 0.562125
H  3.761584 -0.194657 1.331749
H  4.714798 -1.597225 0.887186
H  4.963229 -2.390709 -1.444678
H  4.312308 -1.447299 -2.785099
H  5.699575 -0.847162 -1.876183
H  1.583371 -0.399003 0.97031
H  0.799316 -3.823431 -0.784204
H  0.148873 -2.600855 -1.863279
H  -1.438351 -4.54209 -0.814765
H  -2.067209 -2.919333 -1.107147
H  2.463177 2.975913 2.097253
H  2.47686 3.918437 0.606328
H  0.160025 1.109162 2.272348
H  -0.090367 4.525108 -0.359562
H  -2.529376 0.592938 2.171259
H  -3.526111 1.923038 1.637069
H  -5.048305 0.129444 0.790184
H  -1.146054 0.692977 -0.890214
H  -5.699868 -1.190966 -1.180165
H  -1.808367 -0.592728 -2.859873
H  -4.086009 -1.553377 -3.026767
elementType: S O C H
totalener: -1590.09391179 hartree
nucrepener: 2894.20946499 hartree
electener: -4484.30337678 hartree
oneelecener: -7929.21444394 hartree
twoeener: 3444.91106717 hartree
cpcmener: -0.04260511 hartree
kineticenergy: 1584.20171594 hartree
xcener: -135.011698287768 hartree
chargesum: 0.0000000
charge: -0.058895 -0.270665 -0.494414 -0.466245 -0.289517 0.121434 0.046218 -0.119856 -0.267142 -0.264963 -0.129663 0.423466 -0.146201 -0.174076 0.296330 -0.113484 0.072325 -0.067356 -0.387661 -0.018275 0.242125 -0.031965 0.022056 -0.187674 -0.155290 -0.161534 -0.216298 -0.149331 0.112705 0.102631 0.106009 0.092987 0.097326 0.096409 0.091065 0.097881 0.128219 0.121193 0.100029 0.129886 0.111115 0.118346 0.124047 0.172514 0.177065 0.103935 0.114302 0.140982 0.130726 0.159423 0.156607 0.161149
qa: -0.0589 -0.2707 -0.4944 -0.4662 -0.2895 0.1214 0.0462 -0.1199 -0.2671 -0.2650 -0.1297 0.4235 -0.1462 -0.1741 0.2963 -0.1135 0.0723 -0.0674 -0.3877 -0.0183 0.2421 -0.0320 0.0221 -0.1877 -0.1553 -0.1615 -0.2163 -0.1493 0.1127 0.1026 0.1060 0.0930 0.0973 0.0964 0.0911 0.0979 0.1282 0.1212 0.1000 0.1299 0.1111 0.1183 0.1240 0.1725 0.1771 0.1039 0.1143 0.1410 0.1307 0.1594 0.1566 0.1611
va: 2.4387 2.1248 1.9966 2.0155 2.2644 3.7440 3.7634 3.8856 3.8975 3.9056 3.8146 4.1253 3.5676 4.0008 4.1462 3.9184 3.8450 3.6642 3.9501 3.9602 3.5694 3.8554 3.6171 3.9375 3.7972 3.8768 3.8826 3.8297 1.0038 1.0258 1.0000 1.0087 1.0006 1.0020 1.0055 1.0013 1.0121 0.9995 1.0057 1.0113 1.0185 0.9966 1.0056 1.0234 0.9972 1.0105 1.0092 1.0003 0.9991 0.9892 0.9936 0.9889
dispcorr: -0.033783097 hartree
energy: -1590.127694888600
dipole: 13.26871 -12.19286 1.07585 -7.98292 6.32246 -1.66046 -9.39055 7.97541 -1.41515
magnitude: 2.43254 au
magnitude: 6.18302 debye
