program: Orca
programVersion: 5.0.2
elementType: S O O O O C C C C C C C C C C C C C C C C C C C C C C C H H H H H H H H H H H H H H H H H H H H H H H H
charge: 0
multiplicity: 1
keywords: wb97x-d3
keywords: def2-TZVPP
keywords: def2/J RIJCOSX
keywords: DEFGRID2
keywords: scfconv7
keywords: smallprint printgap noloewdin
keywords: NOSOSCF
formula: C23H24O4S
InChI: InChI=1/C23H24O4S/c1-23(2)19(12-17-8-9-28-22(17)25)20(23)21(24)27-14-16-11-18(26-13-16)10-15-6-4-3-5-7-15/h3-7,11-13,19-20H,8-10,14H2,1-2H3
52 atoms
S  -0.255943 -2.064069 3.214939
O  1.707044 2.011521 -1.14406
O  2.416542 0.953663 0.693397
O  2.139233 -3.133229 3.0329
O  -1.764402 2.41907 1.707021
C  3.842642 -0.872791 -1.484972
C  2.621679 -1.57526 -1.008492
C  2.518511 -0.123152 -1.45379
C  4.939479 -0.526407 -0.509937
C  4.352192 -1.209144 -2.864842
C  2.46336 -2.004284 0.396704
C  2.231429 0.964929 -0.501991
C  1.303696 -2.037846 1.055271
C  -0.039639 -1.583349 0.586431
C  1.271352 -2.5219 2.452829
C  -0.768047 -1.027643 1.806439
C  1.187055 3.093405 -0.360398
C  -0.112389 2.713325 0.253528
C  -1.220887 2.101023 -0.417456
C  -0.496587 2.870979 1.53878
C  -2.192756 1.941122 0.510998
C  -3.563447 1.36455 0.457963
C  -3.837767 0.757339 -0.890366
C  -3.369168 -0.517971 -1.196566
C  -4.521914 1.472403 -1.867381
C  -3.578753 -1.066826 -2.453047
C  -4.73616 0.925057 -3.126172
C  -4.264224 -0.345692 -3.422605
H  2.151541 -2.251963 -1.718224
H  2.060973 0.022159 -2.424919
H  5.489141 0.351755 -0.851984
H  4.589399 -0.32545 0.499706
H  5.648382 -1.354104 -0.450109
H  5.031018 -2.062725 -2.821561
H  3.540342 -1.463541 -3.546828
H  4.900904 -0.369196 -3.293966
H  3.356244 -2.350719 0.9087
H  -0.598366 -2.431337 0.180418
H  0.014699 -0.829531 -0.199366
H  -1.850386 -1.0695 1.708489
H  -0.468276 -0.001369 2.011904
H  1.905108 3.422869 0.391865
H  1.058647 3.904851 -1.075714
H  -1.275155 1.816933 -1.456212
H  -0.003613 3.277856 2.407529
H  -3.669091 0.606869 1.239581
H  -4.301564 2.140781 0.676829
H  -2.835332 -1.087303 -0.444575
H  -4.891249 2.465894 -1.642696
H  -3.208852 -2.059459 -2.674398
H  -5.27273 1.493102 -3.874837
H  -4.430698 -0.772981 -4.402655
elementType: S O C H
totalener: -1590.09556107 hartree
nucrepener: 2815.33664058 hartree
electener: -4405.43220165 hartree
oneelecener: -7770.40118781 hartree
twoeener: 3364.96898616 hartree
cpcmener: -0.04607801 hartree
kineticenergy: 1584.21510323 hartree
xcener: -135.010021159546 hartree
chargesum: -0.0000000
charge: -0.062805 -0.289712 -0.483114 -0.453858 -0.290039 0.121822 -0.032226 -0.102855 -0.293749 -0.262589 -0.120081 0.391662 -0.083224 -0.138404 0.273029 -0.102142 0.114139 -0.051677 -0.334109 -0.051370 0.179307 -0.026300 0.016341 -0.214994 -0.182294 -0.168732 -0.163194 -0.162819 0.121198 0.100186 0.104028 0.096114 0.103146 0.095543 0.089621 0.097221 0.133370 0.121368 0.086011 0.123125 0.114621 0.117542 0.122074 0.155498 0.175727 0.115091 0.110108 0.171900 0.141254 0.158082 0.159766 0.161395
qa: -0.0628 -0.2897 -0.4831 -0.4539 -0.2900 0.1218 -0.0322 -0.1029 -0.2937 -0.2626 -0.1201 0.3917 -0.0832 -0.1384 0.2730 -0.1021 0.1141 -0.0517 -0.3341 -0.0514 0.1793 -0.0263 0.0163 -0.2150 -0.1823 -0.1687 -0.1632 -0.1628 0.1212 0.1002 0.1040 0.0961 0.1031 0.0955 0.0896 0.0972 0.1334 0.1214 0.0860 0.1231 0.1146 0.1175 0.1221 0.1555 0.1757 0.1151 0.1101 0.1719 0.1413 0.1581 0.1598 0.1614
va: 2.4450 2.1162 1.9993 2.0301 2.2413 3.7515 3.8840 3.8669 3.9039 3.9003 3.8657 4.0863 3.5763 3.9718 4.1882 3.9266 3.8231 3.6464 3.9167 3.9224 3.6362 3.8265 3.5959 3.8933 3.9345 3.9296 3.8931 3.8856 1.0050 1.0308 1.0002 1.0130 0.9983 1.0018 1.0045 1.0018 1.0108 1.0057 1.0128 1.0137 1.0118 1.0096 0.9886 1.0105 0.9940 1.0013 1.0088 0.9803 1.0039 0.9929 0.9899 0.9887
dispcorr: -0.031101860 hartree
energy: -1590.126662930165
dipole: 6.63984 -7.81223 -1.17240 0.84718 0.56145 1.40863 -19.62464 16.28011 -3.34453
magnitude: 3.81374 au
magnitude: 9.69377 debye
