program: Orca
programVersion: 5.0.2
elementType: S O O O O C C C C C C C C C C C C C C C C C C C C C C C H H H H H H H H H H H H H H H H H H H H H H H H
charge: 0
multiplicity: 1
keywords: wb97x-d3
keywords: def2-TZVPP
keywords: def2/J RIJCOSX
keywords: DEFGRID2
keywords: scfconv7
keywords: smallprint printgap noloewdin
keywords: NOSOSCF
formula: C23H24O4S
InChI: InChI=1/C23H24O4S/c1-23(2)19(12-17-8-9-28-22(17)25)20(23)21(24)27-14-16-11-18(26-13-16)10-15-6-4-3-5-7-15/h3-7,11-13,19-20H,8-10,14H2,1-2H3
52 atoms
S  -0.702565 -3.166776 0.480493
O  2.220669 0.884117 -1.853368
O  2.828514 2.360838 -0.287665
O  -0.069051 -1.149697 2.039478
O  -1.466266 1.612144 0.468169
C  4.866262 0.187938 0.620864
C  3.862742 -0.855132 0.204079
C  4.130664 0.370827 -0.667032
C  4.607776 1.054634 1.82934
C  6.319814 -0.200018 0.48388
C  2.549416 -0.987586 0.853186
C  3.014336 1.326566 -0.882432
C  1.580973 -1.794518 0.407782
C  1.597989 -2.65501 -0.813853
C  0.293274 -1.861192 1.129329
C  0.62094 -3.807376 -0.592716
C  1.054448 1.661382 -2.186842
C  -0.060061 1.407722 -1.2360
C  -0.981966 0.309282 -1.254535
C  -0.406234 2.159836 -0.165009
C  -1.81302 0.482379 -0.201155
C  -2.979063 -0.282057 0.312562
C  -4.255708 0.520151 0.250125
C  -5.076103 0.453432 -0.872615
C  -4.615646 1.366605 1.295315
C  -6.232973 1.216817 -0.950974
C  -5.769408 2.135196 1.217909
C  -6.581024 2.063545 0.093311
H  4.25891 -1.776216 -0.211751
H  4.677148 0.155491 -1.580672
H  3.565906 1.326213 1.978731
H  4.942351 0.53199 2.72692
H  5.178251 1.98175 1.758009
H  6.946805 0.68606 0.369989
H  6.660212 -0.737437 1.370463
H  6.490364 -0.841503 -0.381683
H  2.351549 -0.395992 1.741203
H  2.590684 -3.043797 -1.040642
H  1.279081 -2.06107 -1.675046
H  1.098249 -4.647434 -0.090537
H  0.183118 -4.16295 -1.522391
H  1.305526 2.721005 -2.236787
H  0.787052 1.33248 -3.189155
H  -1.017737 -0.497358 -1.970137
H  -0.015798 3.07745 0.245985
H  -3.07155 -1.188158 -0.286016
H  -2.790272 -0.598638 1.342477
H  -4.808498 -0.205147 -1.690711
H  -3.993384 1.421455 2.180651
H  -6.86395 1.148444 -1.827808
H  -6.036203 2.789013 2.038356
H  -7.482106 2.6599 0.033289
elementType: S O C H
totalener: -1590.09367684 hartree
nucrepener: 2804.24465905 hartree
electener: -4394.33833590 hartree
oneelecener: -7750.24506050 hartree
twoeener: 3355.90672460 hartree
cpcmener: -0.04656969 hartree
kineticenergy: 1584.21626237 hartree
xcener: -135.008793807074 hartree
chargesum: 0.0000000
charge: -0.056148 -0.277915 -0.470704 -0.464235 -0.289330 0.128252 -0.083451 -0.104837 -0.283801 -0.265621 -0.009799 0.407211 -0.166792 -0.125803 0.280471 -0.116740 0.068172 -0.085649 -0.336455 -0.011592 0.224643 -0.031993 0.052449 -0.206839 -0.207708 -0.160506 -0.166826 -0.171074 0.115538 0.112102 0.081327 0.101670 0.103216 0.097070 0.095706 0.089370 0.135879 0.101751 0.102913 0.119918 0.119368 0.126648 0.123228 0.158957 0.170255 0.103724 0.107461 0.143636 0.142507 0.159749 0.159710 0.160918
qa: -0.0561 -0.2779 -0.4707 -0.4642 -0.2893 0.1283 -0.0835 -0.1048 -0.2838 -0.2656 -0.0098 0.4072 -0.1668 -0.1258 0.2805 -0.1167 0.0682 -0.0856 -0.3365 -0.0116 0.2246 -0.0320 0.0524 -0.2068 -0.2077 -0.1605 -0.1668 -0.1711 0.1155 0.1121 0.0813 0.1017 0.1032 0.0971 0.0957 0.0894 0.1359 0.1018 0.1029 0.1199 0.1194 0.1266 0.1232 0.1590 0.1703 0.1037 0.1075 0.1436 0.1425 0.1597 0.1597 0.1609
va: 2.4413 2.1135 2.0211 2.0076 2.2628 3.8033 3.8522 3.8521 3.9018 3.8933 3.6963 4.1459 3.6252 3.9829 4.1774 3.9541 3.8141 3.6117 3.9600 3.9529 3.4971 3.7549 3.6134 3.9390 3.9527 3.8916 3.9014 3.8887 1.0045 1.0231 1.0119 1.0012 1.0011 1.0023 1.0025 1.0040 1.0223 1.0125 1.0096 1.0070 1.0086 1.0088 0.9960 1.0106 1.0043 1.0181 1.0173 1.0035 1.0091 0.9903 0.9905 0.9895
dispcorr: -0.030558843 hartree
energy: -1590.124235685241
dipole: 15.37581 -13.57492 1.80089 -0.65766 -1.33678 -1.99444 -2.13812 -0.41707 -2.55520
magnitude: 3.70810 au
magnitude: 9.42524 debye
