program: Orca
programVersion: 5.0.2
elementType: S O O O O C C C C C C C C C C C C C C C C C C C C C C C H H H H H H H H H H H H H H H H H H H H H H H H
charge: 0
multiplicity: 1
keywords: wb97x-d3
keywords: def2-TZVPP
keywords: def2/J RIJCOSX
keywords: DEFGRID2
keywords: scfconv7
keywords: smallprint printgap noloewdin
keywords: NOSOSCF
formula: C23H24O4S
InChI: InChI=1/C23H24O4S/c1-23(2)19(12-17-8-9-28-22(17)25)20(23)21(24)27-14-16-11-18(26-13-16)10-15-6-4-3-5-7-15/h3-7,11-13,19-20H,8-10,14H2,1-2H3
52 atoms
S  -1.698467 -3.303606 0.771049
O  2.552187 2.600199 -0.518092
O  3.118521 1.356842 1.252454
O  -0.486594 -1.439976 2.162076
O  -1.698736 3.40973 0.211787
C  3.944734 -0.857313 -0.738448
C  2.450951 -0.841092 -0.963052
C  3.270952 0.458646 -0.974857
C  4.514048 -1.269862 0.596781
C  4.767373 -1.360124 -1.902161
C  1.498463 -1.116117 0.11179
C  2.998996 1.483926 0.055725
C  0.416042 -1.891996 -0.025212
C  -0.027237 -2.637775 -1.244116
C  -0.504182 -2.054161 1.116051
C  -0.929001 -3.792012 -0.802719
C  1.950332 3.610761 0.313259
C  0.503663 3.312213 0.485944
C  -0.105726 2.225744 1.198014
C  -0.516785 3.987719 -0.091646
C  -1.438513 2.32653 0.990967
C  -2.57856 1.454944 1.356287
C  -3.049702 0.545968 0.238059
C  -2.371266 0.426176 -0.970744
C  -4.20101 -0.216283 0.431686
C  -2.839649 -0.425212 -1.965532
C  -4.660838 -1.07691 -0.552487
C  -3.982211 -1.182896 -1.760416
H  2.127026 -1.146479 -1.950916
H  3.387277 0.874757 -1.968982
H  3.89708 -1.011136 1.451237
H  4.647554 -2.352852 0.605031
H  5.49626 -0.818799 0.745981
H  4.83835 -2.448638 -1.87949
H  4.335408 -1.073144 -2.861489
H  5.78105 -0.957866 -1.858108
H  1.674578 -0.668385 1.082852
H  0.813453 -3.030131 -1.815447
H  -0.583475 -1.969674 -1.9049
H  -0.359068 -4.704976 -0.639572
H  -1.712225 -3.99903 -1.528026
H  2.475638 3.693588 1.264176
H  2.084385 4.545902 -0.227282
H  0.380326 1.459143 1.780158
H  -0.54612 4.869767 -0.712635
H  -2.276811 0.845172 2.210304
H  -3.420743 2.059542 1.703856
H  -1.466406 0.992727 -1.153996
H  -4.741112 -0.136292 1.36816
H  -2.303765 -0.492282 -2.903981
H  -5.552143 -1.665906 -0.377822
H  -4.34244 -1.848705 -2.533986
elementType: S O C H
totalener: -1590.09592267 hartree
nucrepener: 2870.70706314 hartree
electener: -4460.80298581 hartree
oneelecener: -7882.85692493 hartree
twoeener: 3422.05393912 hartree
cpcmener: -0.04305618 hartree
kineticenergy: 1584.19728966 hartree
xcener: -135.009962970022 hartree
chargesum: 0.0000000
charge: -0.053997 -0.284656 -0.480738 -0.472758 -0.288473 0.116481 0.055517 -0.109537 -0.276039 -0.263346 -0.168896 0.414062 -0.119863 -0.167233 0.286286 -0.120020 0.070416 -0.073959 -0.323151 -0.036342 0.238157 -0.042368 0.061205 -0.198248 -0.209636 -0.186540 -0.154656 -0.179161 0.114523 0.106268 0.095543 0.096921 0.104628 0.096646 0.091210 0.097162 0.134295 0.110867 0.120226 0.125732 0.117842 0.119712 0.119427 0.156908 0.176250 0.106545 0.115440 0.135996 0.141251 0.165376 0.158669 0.160062
qa: -0.0540 -0.2847 -0.4807 -0.4728 -0.2885 0.1165 0.0555 -0.1095 -0.2760 -0.2633 -0.1689 0.4141 -0.1199 -0.1672 0.2863 -0.1200 0.0704 -0.0740 -0.3232 -0.0363 0.2382 -0.0424 0.0612 -0.1982 -0.2096 -0.1865 -0.1547 -0.1792 0.1145 0.1063 0.0955 0.0969 0.1046 0.0966 0.0912 0.0972 0.1343 0.1109 0.1202 0.1257 0.1178 0.1197 0.1194 0.1569 0.1762 0.1065 0.1154 0.1360 0.1413 0.1654 0.1587 0.1601
va: 2.4486 2.1180 2.0107 2.0029 2.2676 3.7488 3.7756 3.9047 3.8924 3.9060 3.7989 4.1077 3.6019 3.9945 4.1648 3.9456 3.8498 3.7294 3.9754 3.9668 3.5759 3.8588 3.5802 3.8045 3.9481 3.8693 3.8606 3.8604 1.0042 1.0271 1.0120 1.0016 0.9990 1.0022 1.0043 1.0019 1.0192 1.0061 1.0023 1.0080 1.0076 1.0109 0.9972 1.0272 0.9948 1.0106 1.0091 1.0051 1.0004 0.9862 0.9881 0.9884
dispcorr: -0.032683094 hartree
energy: -1590.128605764228
dipole: 13.52405 -12.63401 0.89004 -7.85812 7.13587 -0.72225 -11.39135 8.13973 -3.25162
magnitude: 3.44773 au
magnitude: 8.76343 debye
