program: Orca
programVersion: 5.0.2
elementType: S O O O O C C C C C C C C C C C C C C C C C C C C C C C H H H H H H H H H H H H H H H H H H H H H H H H
charge: 0
multiplicity: 1
keywords: wb97x-d3
keywords: def2-TZVPP
keywords: def2/J RIJCOSX
keywords: DEFGRID2
keywords: scfconv7
keywords: smallprint printgap noloewdin
keywords: NOSOSCF
formula: C23H24O4S
InChI: InChI=1/C23H24O4S/c1-23(2)19(12-17-8-9-28-22(17)25)20(23)21(24)27-14-16-11-18(26-13-16)10-15-6-4-3-5-7-15/h3-7,11-13,19-20H,8-10,14H2,1-2H3
52 atoms
S  -1.618129 -1.327611 -1.119062
O  2.310672 1.519636 -1.113079
O  3.407866 1.955175 0.786318
O  -0.54437 -1.804224 1.230177
O  -1.084052 1.505556 1.530694
C  4.641878 -0.884852 0.367286
C  3.447195 -1.294862 -0.453903
C  4.056638 0.095911 -0.596102
C  4.5011 -0.709792 1.859525
C  5.966573 -1.488007 -0.034452
C  2.101011 -1.419853 0.130924
C  3.246438 1.278254 -0.200301
C  0.988119 -1.502704 -0.603234
C  0.881499 -1.478673 -2.093991
C  -0.332499 -1.585754 0.056587
C  -0.463176 -0.845084 -2.439957
C  1.419707 2.627536 -0.916923
C  0.235019 2.262963 -0.085245
C  -1.131075 2.532204 -0.423726
C  0.196488 1.636223 1.115903
C  -1.889199 2.056293 0.591861
C  -3.355178 2.020109 0.837553
C  -3.942181 0.635875 0.692915
C  -4.724481 0.314585 -0.410833
C  -3.686003 -0.350933 1.641376
C  -5.237947 -0.965924 -0.569627
C  -4.187848 -1.634553 1.480222
C  -4.966512 -1.946577 0.37331
H  3.636782 -1.943139 -1.303456
H  4.59563 0.259446 -1.525602
H  3.550366 -0.285526 2.173953
H  4.605792 -1.678115 2.351609
H  5.289709 -0.060393 2.241346
H  6.042324 -1.61869 -1.114773
H  6.794078 -0.85092 0.282672
H  6.102037 -2.466152 0.430102
H  2.004929 -1.416887 1.212172
H  0.917871 -2.499156 -2.48464
H  1.694075 -0.92303 -2.561034
H  -0.850995 -1.18707 -3.396725
H  -0.39853 0.242773 -2.460167
H  1.962414 3.477762 -0.500816
H  1.092829 2.906524 -1.916801
H  -1.490364 3.019899 -1.316541
H  0.951833 1.239812 1.775296
H  -3.567966 2.413437 1.835926
H  -3.828037 2.697753 0.126404
H  -4.933901 1.072888 -1.156242
H  -3.094552 -0.118892 2.518607
H  -5.848472 -1.197146 -1.433207
H  -3.976736 -2.390376 2.225925
H  -5.361711 -2.946679 0.250144
elementType: S O C H
totalener: -1590.09046047 hartree
nucrepener: 2916.76467106 hartree
electener: -4506.85513153 hartree
oneelecener: -7975.44166390 hartree
twoeener: 3468.58653237 hartree
cpcmener: -0.04674790 hartree
kineticenergy: 1584.22338793 hartree
xcener: -135.015162092967 hartree
chargesum: 0.0000000
charge: -0.067222 -0.271806 -0.467973 -0.476187 -0.286164 0.120632 -0.066359 -0.108161 -0.286973 -0.264541 -0.067798 0.404699 -0.132464 -0.159645 0.314655 -0.087451 0.075676 -0.004813 -0.360900 -0.063226 0.225769 -0.067247 0.102390 -0.221745 -0.239665 -0.136773 -0.158961 -0.178736 0.114405 0.112602 0.080243 0.103706 0.103678 0.089219 0.097102 0.095417 0.135489 0.113246 0.093417 0.129940 0.107917 0.129149 0.124714 0.161255 0.164411 0.117760 0.101374 0.139109 0.140373 0.158891 0.158651 0.158918
qa: -0.0672 -0.2718 -0.4680 -0.4762 -0.2862 0.1206 -0.0664 -0.1082 -0.2870 -0.2645 -0.0678 0.4047 -0.1325 -0.1596 0.3147 -0.0875 0.0757 -0.0048 -0.3609 -0.0632 0.2258 -0.0672 0.1024 -0.2217 -0.2397 -0.1368 -0.1590 -0.1787 0.1144 0.1126 0.0802 0.1037 0.1037 0.0892 0.0971 0.0954 0.1355 0.1132 0.0934 0.1299 0.1079 0.1291 0.1247 0.1613 0.1644 0.1178 0.1014 0.1391 0.1404 0.1589 0.1587 0.1589
va: 2.4616 2.1244 2.0179 2.0004 2.2588 3.8069 3.8464 3.8524 3.9163 3.8917 3.7645 4.1503 3.5846 4.0120 4.1315 3.9368 3.7825 3.5284 3.9699 3.9092 3.5784 3.8194 3.5163 3.9391 3.8969 3.8483 3.8616 3.8852 1.0038 1.0192 1.0043 1.0009 1.0025 1.0037 1.0022 1.0024 1.0204 1.0057 1.0158 1.0128 1.0100 1.0082 0.9997 1.0051 1.0061 1.0028 1.0127 1.0034 1.0183 0.9886 0.9912 0.9893
dispcorr: -0.034569706 hartree
energy: -1590.125030176584
dipole: 14.85863 -13.75285 1.10578 -3.68681 4.05774 0.37092 -3.62351 0.39235 -3.23116
magnitude: 3.43522 au
magnitude: 8.73163 debye
