program: Orca
programVersion: 5.0.2
elementType: S O O O O C C C C C C C C C C C C C C C C C C C C C C C H H H H H H H H H H H H H H H H H H H H H H H H
charge: 0
multiplicity: 1
keywords: wb97x-d3
keywords: def2-TZVPP
keywords: def2/J RIJCOSX
keywords: DEFGRID2
keywords: scfconv7
keywords: smallprint printgap noloewdin
keywords: NOSOSCF
formula: C23H24O4S
InChI: InChI=1/C23H24O4S/c1-23(2)19(12-17-8-9-28-22(17)25)20(23)21(24)27-14-16-11-18(26-13-16)10-15-6-4-3-5-7-15/h3-7,11-13,19-20H,8-10,14H2,1-2H3
52 atoms
S  -0.683066 -2.894965 -1.412859
O  2.348021 2.005105 -0.737436
O  2.294844 1.611418 1.462749
O  -0.056138 -2.597292 1.123373
O  -1.864186 0.854197 -1.600503
C  4.723826 -0.253589 1.046024
C  3.794428 -0.887594 0.049182
C  4.00652 0.635449 0.078069
C  4.42312 -0.278305 2.525099
C  6.198854 -0.421591 0.759339
C  2.47319 -1.41797 0.412747
C  2.816114 1.461542 0.382852
C  1.620393 -1.939096 -0.475889
C  1.816727 -2.081508 -1.951905
C  0.314947 -2.4579 -0.020564
C  0.436368 -2.095296 -2.603341
C  1.119373 2.753202 -0.680811
C  -0.074737 1.870089 -0.763055
C  -0.678577 1.063737 0.259426
C  -0.839067 1.692931 -1.866245
C  -1.759178 0.472759 -0.301164
C  -2.838308 -0.388167 0.250721
C  -4.046889 0.426569 0.646537
C  -4.21373 0.838982 1.965383
C  -4.992205 0.809586 -0.301221
C  -5.302737 1.618042 2.332367
C  -6.080514 1.591602 0.062135
C  -6.239042 1.998841 1.380543
H  4.256326 -1.363679 -0.808778
H  4.587885 1.007789 -0.758541
H  4.848922 -1.183778 2.959583
H  4.892506 0.573102 3.019634
H  3.367666 -0.260742 2.778705
H  6.774218 0.379262 1.226925
H  6.56186 -1.370209 1.157775
H  6.413144 -0.404258 -0.309922
H  2.1650 -1.374159 1.451727
H  2.334113 -3.019143 -2.168886
H  2.416467 -1.273839 -2.36968
H  0.422672 -2.652303 -3.53684
H  0.073623 -1.086731 -2.794066
H  1.097048 3.378283 0.211746
H  1.157257 3.410582 -1.546962
H  -0.362464 0.952181 1.283689
H  -0.778039 2.089859 -2.867844
H  -3.116718 -1.149797 -0.480669
H  -2.443194 -0.91074 1.12191
H  -3.486435 0.544578 2.712828
H  -4.881763 0.491019 -1.331003
H  -5.420095 1.925786 3.363476
H  -6.807813 1.881185 -0.68534
H  -7.088638 2.605969 1.664817
elementType: S O C H
totalener: -1590.09493339 hartree
nucrepener: 2807.81462736 hartree
electener: -4397.90956075 hartree
oneelecener: -7756.97030917 hartree
twoeener: 3359.06074842 hartree
cpcmener: -0.04272128 hartree
kineticenergy: 1584.21312893 hartree
xcener: -135.007804587774 hartree
chargesum: -0.0000000
charge: -0.068347 -0.275105 -0.481875 -0.461962 -0.283927 0.140372 -0.063553 -0.104110 -0.278490 -0.263426 -0.054507 0.416877 -0.153693 -0.142623 0.299324 -0.116377 0.064140 -0.049930 -0.321040 -0.049880 0.224362 -0.050130 0.039491 -0.200875 -0.216470 -0.159923 -0.161106 -0.173167 0.114533 0.105091 0.096338 0.104004 0.087352 0.098077 0.096992 0.090075 0.136374 0.112513 0.094627 0.131472 0.114738 0.122853 0.118903 0.158448 0.176649 0.111070 0.110546 0.142971 0.141806 0.159736 0.159399 0.161385
qa: -0.0683 -0.2751 -0.4819 -0.4620 -0.2839 0.1404 -0.0636 -0.1041 -0.2785 -0.2634 -0.0545 0.4169 -0.1537 -0.1426 0.2993 -0.1164 0.0641 -0.0499 -0.3210 -0.0499 0.2244 -0.0501 0.0395 -0.2009 -0.2165 -0.1599 -0.1611 -0.1732 0.1145 0.1051 0.0963 0.1040 0.0874 0.0981 0.0970 0.0901 0.1364 0.1125 0.0946 0.1315 0.1147 0.1229 0.1189 0.1584 0.1766 0.1111 0.1105 0.1430 0.1418 0.1597 0.1594 0.1614
va: 2.4201 2.1193 2.0106 2.0172 2.2442 3.7972 3.8330 3.8654 3.8869 3.8954 3.7794 4.1378 3.5831 3.9991 4.1586 3.9235 3.8471 3.5930 3.9562 3.9322 3.5461 3.7510 3.6423 3.9370 3.9614 3.8938 3.9006 3.8901 1.0047 1.0300 1.0018 0.9995 1.0171 1.0021 1.0025 1.0037 1.0227 1.0032 1.0105 1.0108 1.0081 1.0053 0.9984 1.0244 0.9939 1.0207 1.0217 1.0041 1.0116 0.9903 0.9905 0.9893
dispcorr: -0.030520252 hartree
energy: -1590.125453640125
dipole: 16.05682 -13.89212 2.16470 3.07157 -2.39799 0.67358 3.12013 -5.73407 -2.61393
magnitude: 3.46010 au
magnitude: 8.79488 debye
