program: Orca
programVersion: 5.0.2
elementType: S O O O O C C C C C C C C C C C C C C C C C C C C C C C H H H H H H H H H H H H H H H H H H H H H H H H
charge: 0
multiplicity: 1
keywords: wb97x-d3
keywords: def2-TZVPP
keywords: def2/J RIJCOSX
keywords: DEFGRID2
keywords: scfconv7
keywords: smallprint printgap noloewdin
keywords: NOSOSCF
formula: C23H24O4S
InChI: InChI=1/C23H24O4S/c1-23(2)19(12-17-8-9-28-22(17)25)20(23)21(24)27-14-16-11-18(26-13-16)10-15-6-4-3-5-7-15/h3-7,11-13,19-20H,8-10,14H2,1-2H3
52 atoms
S  -1.56112 -2.505431 1.258387
O  2.47722 2.455935 -0.500982
O  2.859484 1.121118 1.253881
O  0.631569 -2.274251 2.706278
O  -1.854693 3.2179 0.154084
C  4.383244 -0.715488 -0.71131
C  2.94443 -1.105525 -0.785328
C  3.354332 0.363265 -0.958557
C  5.146615 -0.799444 0.588046
C  5.234595 -1.064547 -1.910878
C  2.165589 -1.536533 0.389556
C  2.899332 1.324794 0.068886
C  0.848053 -1.74714 0.367479
C  -0.098257 -1.526076 -0.767527
C  0.156306 -2.177125 1.611416
C  -1.321579 -2.411865 -0.538909
C  1.793821 3.395263 0.337377
C  0.343957 3.070286 0.42092
C  -0.277293 1.918236 1.004644
C  -0.671735 3.812319 -0.078168
C  -1.608905 2.057251 0.804528
C  -2.764399 1.195449 1.152334
C  -3.414499 0.451302 0.005069
C  -4.35587 -0.531499 0.30699
C  -3.118414 0.693085 -1.331108
C  -4.986531 -1.249881 -0.694633
C  -3.748857 -0.027272 -2.339047
C  -4.684639 -0.999554 -2.026994
H  2.622136 -1.557337 -1.71941
H  3.297623 0.740038 -1.97298
H  6.008866 -0.131886 0.55648
H  4.562478 -0.532385 1.462837
H  5.523312 -1.814574 0.724915
H  6.084254 -0.385797 -1.996765
H  5.625904 -2.078792 -1.818494
H  4.67279 -1.01176 -2.844356
H  2.685616 -1.705806 1.324853
H  0.348903 -1.735637 -1.740736
H  -0.410025 -0.476746 -0.778928
H  -1.160609 -3.419053 -0.923417
H  -2.218409 -2.003696 -0.998585
H  2.253447 3.428039 1.325846
H  1.939114 4.365142 -0.137595
H  0.209671 1.10231 1.5142
H  -0.696385 4.756649 -0.598246
H  -2.416158 0.461435 1.88243
H  -3.527782 1.79246 1.662054
H  -4.589153 -0.743384 1.343749
H  -2.393455 1.447577 -1.604393
H  -5.711388 -2.01028 -0.434932
H  -3.504533 0.178134 -3.373196
H  -5.174894 -1.559405 -2.812444
totalener: -1590.07933159 hartree
nucrepener: 2858.90575179 hartree
electener: -4448.98508339 hartree
oneelecener: -7857.50966511 hartree
twoeener: 3408.52458172 hartree
kineticenergy: 1584.27624768 hartree
xcener: -135.017041934670 hartree
chargesum: 0.0000000
charge: -0.056676 -0.263548 -0.392765 -0.316522 -0.259690 0.124190 -0.074112 -0.073681 -0.275459 -0.236740 0.030997 0.340854 -0.237493 -0.124499 0.234968 -0.093284 0.063424 -0.031491 -0.323556 -0.050733 0.230680 -0.098669 0.061085 -0.217490 -0.172218 -0.103691 -0.106597 -0.143164 0.088726 0.082969 0.086888 0.109317 0.093952 0.093841 0.091849 0.071062 0.120044 0.081475 0.080359 0.115971 0.084041 0.118810 0.093188 0.186738 0.133729 0.108564 0.110893 0.116765 0.120909 0.127255 0.123951 0.124586
qa: -0.0567 -0.2635 -0.3928 -0.3165 -0.2597 0.1242 -0.0741 -0.0737 -0.2755 -0.2367 0.0310 0.3409 -0.2375 -0.1245 0.2350 -0.0933 0.0634 -0.0315 -0.3236 -0.0507 0.2307 -0.0987 0.0611 -0.2175 -0.1722 -0.1037 -0.1066 -0.1432 0.0887 0.0830 0.0869 0.1093 0.0940 0.0938 0.0918 0.0711 0.1200 0.0815 0.0804 0.1160 0.0840 0.1188 0.0932 0.1867 0.1337 0.1086 0.1109 0.1168 0.1209 0.1273 0.1240 0.1246
va: 2.4194 2.1342 2.0835 2.1719 2.2911 3.7820 3.8357 3.8723 3.9088 3.8947 3.7385 4.1669 3.6639 3.9605 4.2105 3.9774 3.8954 3.7537 3.9965 3.9980 3.5571 3.8868 3.6153 3.9711 3.8795 3.9060 3.9141 3.9444 1.0090 1.0322 1.0026 1.0213 0.9991 1.0050 1.0045 1.0072 1.0304 1.0158 1.0322 1.0052 1.0148 1.0073 0.9962 1.0005 1.0088 1.0110 1.0056 1.0130 1.0145 1.0001 1.0022 1.0012
dispcorr: -0.032612972 hartree
energy: -1590.111944566695
dipole: 12.78546 -12.60199 0.18346 -3.58758 4.06682 0.47923 -12.62367 10.57774 -2.04592
magnitude: 2.10930 au
magnitude: 5.36141 debye
