program: Orca
programVersion: 5.0.2
elementType: S O O O O C C C C C C C C C C C C C C C C C C C C C C C H H H H H H H H H H H H H H H H H H H H H H H H
charge: 0
multiplicity: 1
keywords: wb97x-d3
keywords: def2-TZVPP
keywords: def2/J RIJCOSX
keywords: DEFGRID2
keywords: scfconv7
keywords: smallprint printgap noloewdin
keywords: NOSOSCF
formula: C23H24O4S
InChI: InChI=1/C23H24O4S/c1-23(2)19(12-17-8-9-28-22(17)25)20(23)21(24)27-14-16-11-18(26-13-16)10-15-6-4-3-5-7-15/h3-7,11-13,19-20H,8-10,14H2,1-2H3
52 atoms
S  -1.58081 -3.068632 1.491529
O  2.609811 1.516603 0.647123
O  2.61381 2.591666 -1.311136
O  0.161563 -1.56386 2.764838
O  -1.385914 3.267652 0.150496
C  3.995706 -0.794408 -0.811036
C  2.519059 -1.066089 -0.852691
C  3.0718 0.283612 -1.31892
C  4.73004 -0.670002 0.502087
C  4.830322 -1.472082 -1.873966
C  1.712467 -1.243934 0.360479
C  2.750415 1.580727 -0.676251
C  0.49153 -1.786346 0.38819
C  -0.369075 -2.224955 -0.752771
C  -0.168607 -2.006708 1.69846
C  -1.234151 -3.385974 -0.262374
C  2.029638 2.656043 1.296265
C  0.571872 2.7104 1.021668
C  -0.417627 1.782635 1.475011
C  -0.080112 3.578979 0.215883
C  -1.585741 2.163984 0.910361
C  -2.951994 1.579869 0.934173
C  -3.239681 0.625226 -0.205093
C  -2.953857 0.959528 -1.527067
C  -3.826324 -0.60788 0.055222
C  -3.251629 0.082684 -2.558664
C  -4.137734 -1.482122 -0.977019
C  -3.848423 -1.141406 -2.289008
H  2.185851 -1.672228 -1.689204
H  3.072122 0.403869 -2.39596
H  5.025457 -1.660288 0.852483
H  5.640627 -0.084972 0.364208
H  4.158358 -0.194958 1.292397
H  5.744114 -0.908272 -2.068758
H  5.118071 -2.475012 -1.55411
H  4.293612 -1.566785 -2.81867
H  2.147813 -0.969754 1.313216
H  0.203376 -2.526334 -1.630836
H  -1.016129 -1.39688 -1.057978
H  -0.714429 -4.339852 -0.351922
H  -2.172804 -3.446099 -0.80846
H  2.228162 2.496342 2.35522
H  2.530625 3.574471 0.987396
H  -0.264241 0.936299 2.125715
H  0.252897 4.425446 -0.361956
H  -3.077605 1.052946 1.881204
H  -3.695607 2.382873 0.931693
H  -2.497064 1.912785 -1.759161
H  -4.040851 -0.893966 1.077198
H  -3.022547 0.360732 -3.579284
H  -4.607094 -2.431193 -0.75038
H  -4.089415 -1.820237 -3.09669
totalener: -1590.07746939 hartree
nucrepener: 2876.35899705 hartree
electener: -4466.43646645 hartree
oneelecener: -7892.47671294 hartree
twoeener: 3426.04024649 hartree
kineticenergy: 1584.28300456 hartree
xcener: -135.016247850444 hartree
chargesum: -0.0000000
charge: -0.041243 -0.274306 -0.363777 -0.342372 -0.265025 0.092963 0.020872 -0.088734 -0.262550 -0.239992 -0.078236 0.355961 -0.152876 -0.126954 0.230066 -0.142915 0.037479 -0.048217 -0.346983 0.015071 0.248051 -0.095816 0.012324 -0.128073 -0.169741 -0.125771 -0.163066 -0.130409 0.083650 0.089049 0.093602 0.092398 0.098629 0.093622 0.090194 0.072025 0.111286 0.084085 0.088776 0.117215 0.103633 0.103095 0.112265 0.173981 0.141264 0.094425 0.104532 0.123189 0.110984 0.125520 0.140325 0.126525
qa: -0.0412 -0.2743 -0.3638 -0.3424 -0.2650 0.0930 0.0209 -0.0887 -0.2625 -0.2400 -0.0782 0.3560 -0.1529 -0.1270 0.2301 -0.1429 0.0375 -0.0482 -0.3470 0.0151 0.2481 -0.0958 0.0123 -0.1281 -0.1697 -0.1258 -0.1631 -0.1304 0.0836 0.0890 0.0936 0.0924 0.0986 0.0936 0.0902 0.0720 0.1113 0.0841 0.0888 0.1172 0.1036 0.1031 0.1123 0.1740 0.1413 0.0944 0.1045 0.1232 0.1110 0.1255 0.1403 0.1265
va: 2.4276 2.0978 2.1445 2.1381 2.2951 3.7714 3.7165 3.8538 3.9069 3.9044 3.8161 4.2312 3.6938 3.9668 4.1880 3.9595 3.9013 3.6853 4.0109 3.9845 3.6159 3.8459 3.7191 3.9284 3.9229 3.9336 3.8810 3.9094 1.0140 1.0277 1.0007 1.0023 1.0179 1.0045 1.0039 1.0087 1.0384 1.0150 1.0231 1.0038 1.0159 0.9954 1.0070 1.0149 1.0112 1.0106 1.0051 1.0236 1.0210 1.0020 0.9952 1.0005
dispcorr: -0.032551096 hartree
energy: -1590.110020487927
dipole: 12.08513 -11.77294 0.31219 -7.38943 6.61642 -0.77301 -10.65623 9.60631 -1.04992
magnitude: 1.34065 au
magnitude: 3.40766 debye
