program: Orca
programVersion: 5.0.2
elementType: S O O O O C C C C C C C C C C C C C C C C C C C C C C C H H H H H H H H H H H H H H H H H H H H H H H H
charge: 0
multiplicity: 1
keywords: wb97x-d3
keywords: def2-TZVPP
keywords: def2/J RIJCOSX
keywords: DEFGRID2
keywords: scfconv7
keywords: smallprint printgap noloewdin
keywords: NOSOSCF
formula: C23H24O4S
InChI: InChI=1/C23H24O4S/c1-23(2)19(12-17-8-9-28-22(17)25)20(23)21(24)27-14-16-11-18(26-13-16)10-15-6-4-3-5-7-15/h3-7,11-13,19-20H,8-10,14H2,1-2H3
52 atoms
S  -1.341649 -2.532469 0.330436
O  2.507127 2.284491 0.06676
O  2.110766 0.489048 1.34581
O  0.734125 -4.05271 0.91095
O  -1.558741 2.547472 -0.998798
C  4.668133 -0.625106 -0.109076
C  3.486002 -1.163459 -0.837001
C  3.571394 0.329072 -0.550904
C  4.850465 -0.952642 1.352524
C  5.971068 -0.504044 -0.862961
C  2.517287 -2.070255 -0.180055
C  2.656793 0.992147 0.402843
C  1.198584 -2.057558 -0.354457
C  0.370827 -1.120776 -1.169993
C  0.357662 -3.050782 0.371283
C  -0.946075 -0.923729 -0.42076
C  1.578832 3.04604 0.82942
C  0.183461 2.846499 0.342357
C  -1.015076 2.852189 1.120398
C  -0.216784 2.660289 -0.93747
C  -2.040011 2.670346 0.253341
C  -3.508842 2.533301 0.436783
C  -3.981881 1.131957 0.134438
C  -3.939396 0.149121 1.117237
C  -4.410236 0.786148 -1.141507
C  -4.317117 -1.153497 0.832825
C  -4.784796 -0.518303 -1.431417
C  -4.73653 -1.492438 -0.445831
H  3.644732 -1.392459 -1.888667
H  3.825869 0.948022 -1.40354
H  5.435328 -0.175609 1.847262
H  3.914143 -1.058036 1.893893
H  5.402242 -1.889411 1.45068
H  5.8152 -0.282929 -1.919738
H  6.591249 0.290668 -0.445442
H  6.537107 -1.435007 -0.800608
H  2.926964 -2.833147 0.475036
H  0.169264 -1.569431 -2.147877
H  0.860793 -0.163933 -1.350612
H  -1.763762 -0.62677 -1.074053
H  -0.839675 -0.178217 0.366608
H  1.649559 2.805656 1.891783
H  1.891584 4.08325 0.70006
H  -1.095098 2.964209 2.189839
H  0.318567 2.592007 -1.870251
H  -3.745839 2.799293 1.468143
H  -4.034716 3.252241 -0.197887
H  -3.596838 0.401408 2.113894
H  -4.447903 1.541224 -1.917452
H  -4.270755 -1.908094 1.606166
H  -5.113462 -0.773894 -2.430341
H  -5.019494 -2.511748 -0.671219
totalener: -1590.07613121 hartree
nucrepener: 2850.25983734 hartree
electener: -4440.33596855 hartree
oneelecener: -7840.45900232 hartree
twoeener: 3400.12303377 hartree
kineticenergy: 1584.28743946 hartree
xcener: -135.016701526953 hartree
chargesum: -0.0000000
charge: -0.048651 -0.270712 -0.364517 -0.324777 -0.248201 0.112093 -0.042550 -0.091749 -0.284298 -0.238502 -0.103528 0.291243 -0.067991 -0.139515 0.216549 -0.112178 0.084961 -0.007386 -0.250762 -0.085447 0.179951 -0.128530 0.072011 -0.136779 -0.141055 -0.187264 -0.128787 -0.109104 0.098330 0.086975 0.087600 0.117954 0.091897 0.071359 0.092597 0.090649 0.121143 0.103478 0.062939 0.114134 0.108152 0.106150 0.106315 0.127276 0.146375 0.101472 0.106410 0.110925 0.107539 0.141368 0.124891 0.129544
qa: -0.0487 -0.2707 -0.3645 -0.3248 -0.2482 0.1121 -0.0425 -0.0917 -0.2843 -0.2385 -0.1035 0.2912 -0.0680 -0.1395 0.2165 -0.1122 0.0850 -0.0074 -0.2508 -0.0854 0.1800 -0.1285 0.0720 -0.1368 -0.1411 -0.1873 -0.1288 -0.1091 0.0983 0.0870 0.0876 0.1180 0.0919 0.0714 0.0926 0.0906 0.1211 0.1035 0.0629 0.1141 0.1082 0.1062 0.1063 0.1273 0.1464 0.1015 0.1064 0.1109 0.1075 0.1414 0.1249 0.1295
va: 2.4430 2.1250 2.1121 2.1686 2.2936 3.7438 3.8719 3.8119 3.9195 3.9028 3.8920 4.1926 3.6204 4.0385 4.2902 3.9167 3.8601 3.6368 4.0167 3.9449 3.6559 3.8740 3.5818 3.8952 3.9620 3.9175 3.9413 3.8850 1.0053 1.0323 1.0036 1.0134 0.9993 1.0076 1.0042 1.0047 1.0190 1.0075 1.0205 1.0129 1.0147 1.0161 0.9873 1.0153 1.0071 1.0124 1.0075 1.0117 1.0155 1.0034 1.0006 1.0017
dispcorr: -0.032589521 hartree
energy: -1590.108720733753
dipole: 14.04930 -13.60090 0.44840 4.87207 -2.91324 1.95883 -2.80762 1.88541 -0.92220
magnitude: 2.21100 au
magnitude: 5.61992 debye
