program: Orca
programVersion: 5.0.2
elementType: S O O O O C C C C C C C C C C C C C C C C C C C C C C C H H H H H H H H H H H H H H H H H H H H H H H H
charge: 0
multiplicity: 1
keywords: wb97x-d3
keywords: def2-TZVPP
keywords: def2/J RIJCOSX
keywords: DEFGRID2
keywords: scfconv7
keywords: smallprint printgap noloewdin
keywords: NOSOSCF
formula: C23H24O4S
InChI: InChI=1/C23H24O4S/c1-23(2)19(12-17-8-9-28-22(17)25)20(23)21(24)27-14-16-11-18(26-13-16)10-15-6-4-3-5-7-15/h3-7,11-13,19-20H,8-10,14H2,1-2H3
52 atoms
S  -1.395346 -2.204967 0.987119
O  2.28017 2.17734 -0.771117
O  2.758617 0.98416 1.056403
O  0.781391 -2.980505 2.263924
O  -1.5223 1.763341 1.443527
C  4.611795 -0.707056 -0.735793
C  3.253419 -1.292027 -0.9145
C  3.465592 0.214186 -1.097124
C  5.265541 -0.66711 0.623937
C  5.600521 -0.949468 -1.853628
C  2.432842 -1.796497 0.205057
C  2.822303 1.136362 -0.135213
C  1.116674 -1.976312 0.105965
C  0.249743 -1.679586 -1.074219
C  0.341297 -2.475292 1.270558
C  -1.118445 -1.259952 -0.539112
C  1.575951 3.127314 0.037724
C  0.197191 2.683658 0.388536
C  -1.009776 2.993554 -0.315989
C  -0.18733 1.927428 1.446496
C  -2.02165 2.413487 0.371235
C  -3.49165 2.349905 0.154007
C  -3.956016 0.996555 -0.331264
C  -4.114038 0.752842 -1.691139
C  -4.206456 -0.035171 0.567147
C  -4.522992 -0.491835 -2.146465
C  -4.615303 -1.281589 0.115802
C  -4.777149 -1.513348 -1.242399
H  3.078989 -1.806129 -1.855794
H  3.447613 0.564292 -2.122655
H  4.572639 -0.500918 1.442216
H  5.786508 -1.609334 0.802876
H  6.009215 0.130541 0.6590
H  6.119329 -1.897959 -1.705603
H  5.116209 -0.987897 -2.830434
H  6.352416 -0.159573 -1.886971
H  2.915257 -2.03307 1.146314
H  0.144929 -2.577828 -1.690914
H  0.664264 -0.894158 -1.708083
H  -1.92594 -1.465953 -1.237789
H  -1.134538 -0.198003 -0.306112
H  2.152095 3.356559 0.934885
H  1.533838 4.02819 -0.573082
H  -1.103958 3.582361 -1.214775
H  0.362141 1.455591 2.243778
H  -4.013316 2.612358 1.078625
H  -3.756081 3.116123 -0.576538
H  -3.918871 1.546448 -2.402985
H  -4.07646 0.132296 1.629062
H  -4.647325 -0.662452 -3.208032
H  -4.802036 -2.074495 0.827681
H  -5.099112 -2.484684 -1.593919
totalener: -1590.07889167 hartree
nucrepener: 2857.06274824 hartree
electener: -4447.14163991 hartree
oneelecener: -7854.07481071 hartree
twoeener: 3406.93317081 hartree
kineticenergy: 1584.28699114 hartree
xcener: -135.015707666880 hartree
chargesum: 0.0000000
charge: -0.048816 -0.265674 -0.397870 -0.321279 -0.245208 0.120289 -0.072225 -0.087631 -0.273664 -0.238338 -0.062021 0.353197 -0.116496 -0.157160 0.222067 -0.080602 0.060566 -0.068274 -0.247624 -0.016403 0.188883 -0.138126 0.050092 -0.138342 -0.126159 -0.139178 -0.164504 -0.119965 0.098657 0.085512 0.107317 0.092978 0.086627 0.091390 0.071075 0.093006 0.116916 0.102448 0.086270 0.109710 0.064228 0.117646 0.099069 0.126332 0.157824 0.112786 0.097080 0.103809 0.118722 0.124720 0.139059 0.127285
qa: -0.0488 -0.2657 -0.3979 -0.3213 -0.2452 0.1203 -0.0722 -0.0876 -0.2737 -0.2383 -0.0620 0.3532 -0.1165 -0.1572 0.2221 -0.0806 0.0606 -0.0683 -0.2476 -0.0164 0.1889 -0.1381 0.0501 -0.1383 -0.1262 -0.1392 -0.1645 -0.1200 0.0987 0.0855 0.1073 0.0930 0.0866 0.0914 0.0711 0.0930 0.1169 0.1024 0.0863 0.1097 0.0642 0.1176 0.0991 0.1263 0.1578 0.1128 0.0971 0.1038 0.1187 0.1247 0.1391 0.1273
va: 2.4348 2.1323 2.0789 2.1734 2.3064 3.7798 3.8498 3.8483 3.9080 3.9006 3.8605 4.1448 3.6310 4.0418 4.2784 3.9531 3.8725 3.6456 4.0273 3.9366 3.6292 3.8760 3.5959 3.9551 3.8829 3.9448 3.8845 3.9016 1.0054 1.0301 1.0212 0.9986 1.0033 1.0051 1.0065 1.0047 1.0266 1.0044 1.0038 1.0153 1.0116 1.0074 0.9956 1.0157 1.0139 1.0073 1.0117 1.0119 1.0212 1.0013 1.0012 1.0007
dispcorr: -0.032172867 hartree
energy: -1590.111064531946
dipole: 12.98301 -12.89286 0.09015 1.68908 -0.48201 1.20708 -13.22725 11.15793 -2.06933
magnitude: 2.39735 au
magnitude: 6.09357 debye
