program: Orca
programVersion: 5.0.2
elementType: S O O O O C C C C C C C C C C C C C C C C C C C C C C C H H H H H H H H H H H H H H H H H H H H H H H H
charge: 0
multiplicity: 1
keywords: wb97x-d3
keywords: def2-TZVPP
keywords: def2/J RIJCOSX
keywords: DEFGRID2
keywords: scfconv7
keywords: smallprint printgap noloewdin
keywords: NOSOSCF
formula: C23H24O4S
InChI: InChI=1/C23H24O4S/c1-23(2)19(12-17-8-9-28-22(17)25)20(23)21(24)27-14-16-11-18(26-13-16)10-15-6-4-3-5-7-15/h3-7,11-13,19-20H,8-10,14H2,1-2H3
52 atoms
S  -1.428344 -2.076305 1.066041
O  2.337323 2.207383 -0.717621
O  2.845888 0.980053 1.080111
O  0.776381 -2.647829 2.395568
O  -1.480192 1.625696 1.384336
C  4.59753 -0.740758 -0.784546
C  3.216562 -1.272703 -0.940715
C  3.475043 0.226507 -1.103182
C  5.278691 -0.749135 0.562344
C  5.553989 -0.993403 -1.927733
C  2.407782 -1.776115 0.189794
C  2.881415 1.148823 -0.110773
C  1.076138 -1.738517 0.19057
C  0.201433 -1.135763 -0.860216
C  0.317529 -2.233065 1.368878
C  -1.209432 -1.70251 -0.69607
C  1.617884 3.122654 0.117889
C  0.240137 2.646383 0.428002
C  -0.960651 2.985013 -0.274074
C  -0.149214 1.810807 1.423672
C  -1.973149 2.343456 0.355322
C  -3.442658 2.302921 0.12965
C  -3.935843 0.964904 -0.367779
C  -4.066331 0.724362 -1.732048
C  -4.249609 -0.054875 0.524195
C  -4.507895 -0.505542 -2.197308
C  -4.690118 -1.28697 0.062649
C  -4.822574 -1.515409 -1.299218
H  2.999387 -1.764804 -1.886261
H  3.44511 0.595816 -2.121709
H  6.034769 0.035944 0.60763
H  4.603171 -0.59934 1.398353
H  5.789405 -1.70337 0.703265
H  5.048655 -0.994997 -2.894664
H  6.332211 -0.229175 -1.961572
H  6.042906 -1.961976 -1.810013
H  2.915236 -2.197602 1.050499
H  0.572712 -1.322618 -1.869538
H  0.172947 -0.049429 -0.730107
H  -1.340618 -2.620336 -1.268619
H  -1.972968 -0.994402 -1.007399
H  2.180117 3.323991 1.030294
H  1.573499 4.045344 -0.459274
H  -1.051198 3.636557 -1.128983
H  0.394791 1.289813 2.194227
H  -3.964119 2.567628 1.054193
H  -3.689489 3.0816 -0.593896
H  -3.824046 1.509628 -2.438749
H  -4.14266 0.110298 1.588933
H  -4.608346 -0.673769 -3.261732
H  -4.924939 -2.071194 0.770107
H  -5.168797 -2.475521 -1.658562
totalener: -1590.07769122 hartree
nucrepener: 2872.36008757 hartree
electener: -4462.43777880 hartree
oneelecener: -7884.77761719 hartree
twoeener: 3422.33983839 hartree
kineticenergy: 1584.28207965 hartree
xcener: -135.015681177813 hartree
chargesum: 0.0000000
charge: -0.044752 -0.265370 -0.389689 -0.322675 -0.236910 0.112495 -0.063256 -0.067104 -0.274739 -0.241470 -0.062021 0.324095 -0.119288 -0.119354 0.228732 -0.098185 0.063656 -0.083365 -0.253190 -0.022676 0.191965 -0.138224 0.084327 -0.147361 -0.165667 -0.127380 -0.153833 -0.121451 0.091311 0.082074 0.085973 0.111738 0.090278 0.070618 0.093060 0.090625 0.115810 0.085411 0.089324 0.113099 0.067359 0.118530 0.098292 0.124733 0.163688 0.111250 0.097254 0.104411 0.119842 0.124259 0.136763 0.126988
qa: -0.0448 -0.2654 -0.3897 -0.3227 -0.2369 0.1125 -0.0633 -0.0671 -0.2747 -0.2415 -0.0620 0.3241 -0.1193 -0.1194 0.2287 -0.0982 0.0637 -0.0834 -0.2532 -0.0227 0.1920 -0.1382 0.0843 -0.1474 -0.1657 -0.1274 -0.1538 -0.1215 0.0913 0.0821 0.0860 0.1117 0.0903 0.0706 0.0931 0.0906 0.1158 0.0854 0.0893 0.1131 0.0674 0.1185 0.0983 0.1247 0.1637 0.1113 0.0973 0.1044 0.1198 0.1243 0.1368 0.1270
va: 2.4406 2.1223 2.0841 2.1721 2.3129 3.7758 3.8803 3.8159 3.9098 3.9042 3.8291 4.1614 3.6169 3.9996 4.2594 3.9910 3.8659 3.6411 4.0309 3.9436 3.6471 3.8799 3.5654 3.9371 3.9143 3.9347 3.8797 3.9080 1.0079 1.0327 1.0039 1.0187 0.9985 1.0068 1.0047 1.0050 1.0255 1.0077 1.0208 1.0045 1.0173 1.0081 0.9952 1.0160 1.0105 1.0059 1.0111 1.0125 1.0212 1.0015 1.0024 1.0008
dispcorr: -0.032957178 hartree
energy: -1590.110648402202
dipole: 12.60234 -12.64416 -0.04182 0.62539 0.35894 0.98434 -13.88416 11.75975 -2.12441
magnitude: 2.34175 au
magnitude: 5.95226 debye
