program: Orca
programVersion: 5.0.2
elementType: S O O O O C C C C C C C C C C C C C C C C C C C C C C C H H H H H H H H H H H H H H H H H H H H H H H H
charge: 0
multiplicity: 1
keywords: wb97x-d3
keywords: def2-TZVPP
keywords: def2/J RIJCOSX
keywords: DEFGRID2
keywords: scfconv7
keywords: smallprint printgap noloewdin
keywords: NOSOSCF
formula: C23H24O4S
InChI: InChI=1/C23H24O4S/c1-23(2)19(12-17-8-9-28-22(17)25)20(23)21(24)27-14-16-11-18(26-13-16)10-15-6-4-3-5-7-15/h3-7,11-13,19-20H,8-10,14H2,1-2H3
52 atoms
S  -1.341023 -2.406977 1.997786
O  2.508808 1.379986 0.463762
O  2.064977 2.448595 -1.448436
O  1.076105 -1.97156 2.949297
O  -1.668357 1.427565 1.588838
C  4.039227 -0.66735 -1.222064
C  2.642496 -1.161458 -1.006325
C  2.885481 0.243187 -1.569674
C  4.956805 -0.386396 -0.05772
C  4.778296 -1.236867 -2.412147
C  2.075012 -1.379822 0.333961
C  2.455798 1.473539 -0.862205
C  0.837062 -1.8216 0.561027
C  -0.224156 -2.143105 -0.442183
C  0.396176 -2.035615 1.961712
C  -1.582633 -1.993596 0.245486
C  1.840632 2.387838 1.236678
C  0.364426 2.212755 1.180677
C  -0.551909 2.775253 0.236257
C  -0.381333 1.405371 1.973429
C  -1.768317 2.261707 0.529981
C  -3.09263 2.370702 -0.133601
C  -3.44003 1.121202 -0.911735
C  -2.659086 0.738853 -1.999957
C  -4.520429 0.325823 -0.553269
C  -2.958874 -0.407334 -2.717909
C  -4.82188 -0.826185 -1.268542
C  -4.043209 -1.195347 -2.353476
H  2.267033 -1.847891 -1.759455
H  2.692867 0.341203 -2.631704
H  4.45903 0.022959 0.815408
H  5.458806 -1.306953 0.244547
H  5.728086 0.32532 -0.356097
H  4.110378 -1.445073 -3.248943
H  5.54283 -0.542718 -2.764684
H  5.273404 -2.171559 -2.143811
H  2.702998 -1.201304 1.198182
H  -0.101484 -3.172503 -0.792875
H  -0.180782 -1.492557 -1.316904
H  -2.334642 -2.653189 -0.180655
H  -1.950566 -0.972883 0.174522
H  2.212396 2.241485 2.249368
H  2.137134 3.383009 0.903219
H  -0.317235 3.458677 -0.562855
H  -0.134801 0.779201 2.816489
H  -3.874401 2.581768 0.600544
H  -3.060551 3.229526 -0.807452
H  -1.803429 1.341692 -2.28193
H  -5.132924 0.605643 0.295318
H  -2.347131 -0.685612 -3.566484
H  -5.667281 -1.434728 -0.975162
H  -4.279362 -2.089969 -2.914698
totalener: -1590.07707370 hartree
nucrepener: 2895.97483370 hartree
electener: -4486.05190740 hartree
oneelecener: -7931.56589952 hartree
twoeener: 3445.51399212 hartree
kineticenergy: 1584.28687846 hartree
xcener: -135.016279843849 hartree
chargesum: -0.0000000
charge: -0.035943 -0.266073 -0.374265 -0.334929 -0.243557 0.118029 -0.034111 -0.092421 -0.271102 -0.241206 -0.063225 0.355766 -0.126121 -0.169493 0.214507 -0.088640 0.034541 -0.043553 -0.246421 -0.061578 0.200100 -0.124274 0.026155 -0.133426 -0.101315 -0.168912 -0.147829 -0.121204 0.095670 0.086991 0.095967 0.096563 0.092634 0.072461 0.094191 0.091461 0.113975 0.101088 0.083131 0.114765 0.053401 0.102948 0.118955 0.146364 0.157775 0.095589 0.111957 0.120911 0.109776 0.128269 0.127350 0.128310
qa: -0.0359 -0.2661 -0.3743 -0.3349 -0.2436 0.1180 -0.0341 -0.0924 -0.2711 -0.2412 -0.0632 0.3558 -0.1261 -0.1695 0.2145 -0.0886 0.0345 -0.0436 -0.2464 -0.0616 0.2001 -0.1243 0.0262 -0.1334 -0.1013 -0.1689 -0.1478 -0.1212 0.0957 0.0870 0.0960 0.0966 0.0926 0.0725 0.0942 0.0915 0.1140 0.1011 0.0831 0.1148 0.0534 0.1029 0.1190 0.1464 0.1578 0.0956 0.1120 0.1209 0.1098 0.1283 0.1274 0.1283
va: 2.4411 2.1038 2.1299 2.1544 2.2956 3.7938 3.7441 3.8664 3.9080 3.9018 3.8363 4.2148 3.5865 3.9756 4.2508 3.9470 3.8917 3.6668 4.0277 3.9695 3.6097 3.8839 3.6482 3.8739 3.9315 3.9364 3.9573 3.8804 1.0063 1.0274 1.0178 1.0003 1.0024 1.0078 1.0044 1.0042 1.0362 1.0004 1.0060 1.0075 1.0259 1.0010 1.0017 1.0215 1.0069 1.0148 1.0056 1.0142 1.0108 1.0006 1.0011 0.9993
dispcorr: -0.033420202 hartree
energy: -1590.110493904014
dipole: 10.85630 -10.91135 -0.05505 -2.27392 2.19752 -0.07640 -15.54137 14.15545 -1.38592
magnitude: 1.38911 au
magnitude: 3.53084 debye
