program: Orca
programVersion: 5.0.2
elementType: S O O O O C C C C C C C C C C C C C C C C C C C C C C C H H H H H H H H H H H H H H H H H H H H H H H H
charge: 0
multiplicity: 1
keywords: wb97x-d3
keywords: def2-TZVPP
keywords: def2/J RIJCOSX
keywords: DEFGRID2
keywords: scfconv7
keywords: smallprint printgap noloewdin
keywords: NOSOSCF
formula: C23H24O4S
InChI: InChI=1/C23H24O4S/c1-23(2)19(12-17-8-9-28-22(17)25)20(23)21(24)27-14-16-11-18(26-13-16)10-15-6-4-3-5-7-15/h3-7,11-13,19-20H,8-10,14H2,1-2H3
52 atoms
S  -0.893277 -1.505688 -2.729371
O  2.189563 1.294814 1.207762
O  3.047025 2.175054 -0.65714
O  -0.711703 -2.40165 -0.256395
O  -1.361025 1.990285 -1.338777
C  4.231482 -0.898533 1.179744
C  3.476205 -1.241912 -0.062917
C  3.992885 0.181179 0.154447
C  3.55329 -0.92683 2.528829
C  5.66209 -1.386689 1.246776
C  2.027343 -1.530285 -0.077475
C  3.03873 1.318573 0.188897
C  1.285274 -1.436702 -1.181116
C  1.736658 -0.969834 -2.527655
C  -0.135652 -1.860684 -1.158406
C  0.501947 -0.488414 -3.293101
C  1.191551 2.3246 1.259284
C  0.023893 2.022343 0.39107
C  -1.117778 1.224767 0.721054
C  -0.18674 2.455601 -0.874091
C  -1.927882 1.243944 -0.36265
C  -3.248261 0.622479 -0.657439
C  -3.934761 0.145913 0.594316
C  -4.756607 1.004716 1.317179
C  -3.744609 -1.150217 1.060578
C  -5.381632 0.578547 2.478481
C  -4.367718 -1.578731 2.224359
C  -5.188832 -0.717423 2.935649
H  4.029203 -1.781603 -0.8279
H  4.848495 0.4360 -0.460581
H  2.493134 -0.699143 2.499687
H  3.668628 -1.920273 2.965903
H  4.022037 -0.212694 3.20644
H  5.701004 -2.412164 1.617667
H  6.148675 -1.370325 0.270579
H  6.253711 -0.765322 1.920651
H  1.550499 -1.875339 0.833469
H  2.202312 -1.797928 -3.070742
H  2.474225 -0.169104 -2.457104
H  0.615088 -0.602093 -4.369065
H  0.284577 0.555646 -3.076272
H  0.88951 2.357475 2.305116
H  1.634727 3.287462 1.004457
H  -1.312972 0.712659 1.64923
H  0.393912 3.078788 -1.534596
H  -3.880252 1.34939 -1.17571
H  -3.110686 -0.211252 -1.353013
H  -4.909511 2.018494 0.965894
H  -3.097728 -1.826315 0.515691
H  -6.022479 1.257758 3.025488
H  -4.211393 -2.591231 2.573044
H  -5.678612 -1.054045 3.840033
totalener: -1590.07693519 hartree
nucrepener: 2857.72148546 hartree
electener: -4447.79842065 hartree
oneelecener: -7855.47972318 hartree
twoeener: 3407.68130253 hartree
kineticenergy: 1584.28059558 hartree
xcener: -135.012675146240 hartree
chargesum: -0.0000000
charge: -0.055115 -0.250641 -0.376471 -0.343214 -0.257281 0.146329 -0.080330 -0.112382 -0.257730 -0.245823 -0.068484 0.339955 -0.112618 -0.161042 0.268765 -0.135930 0.017359 -0.014678 -0.237462 -0.049076 0.147093 -0.064688 0.037399 -0.156648 -0.153657 -0.127550 -0.144906 -0.123871 0.093620 0.090869 0.083169 0.091632 0.094129 0.090422 0.072405 0.094281 0.121157 0.104606 0.093701 0.113052 0.113232 0.100205 0.120672 0.132060 0.154826 0.097417 0.103812 0.106017 0.130243 0.121291 0.126496 0.123386
qa: -0.0551 -0.2506 -0.3765 -0.3432 -0.2573 0.1463 -0.0803 -0.1124 -0.2577 -0.2458 -0.0685 0.3400 -0.1126 -0.1610 0.2688 -0.1359 0.0174 -0.0147 -0.2375 -0.0491 0.1471 -0.0647 0.0374 -0.1566 -0.1537 -0.1276 -0.1449 -0.1239 0.0936 0.0909 0.0832 0.0916 0.0941 0.0904 0.0724 0.0943 0.1212 0.1046 0.0937 0.1131 0.1132 0.1002 0.1207 0.1321 0.1548 0.0974 0.1038 0.1060 0.1302 0.1213 0.1265 0.1234
va: 2.4080 2.1195 2.1157 2.1392 2.2799 3.7353 3.8672 3.8279 3.9128 3.9058 3.7868 4.2350 3.5993 3.9798 4.1672 3.9541 3.8782 3.5859 3.9679 3.9368 3.6646 3.8345 3.6138 4.0088 3.9278 3.9619 3.9947 3.9446 1.0058 1.0299 1.0183 1.0004 1.0051 1.0045 1.0073 1.0040 1.0254 1.0034 1.0175 1.0101 1.0090 0.9973 1.0078 1.0130 1.0122 1.0160 1.0204 1.0111 1.0368 1.0010 1.0006 0.9996
dispcorr: -0.032213859 hartree
energy: -1590.109149052607
dipole: 14.25618 -13.01329 1.24289 -2.95290 3.08111 0.12821 10.04060 -9.93614 0.10446
magnitude: 1.25385 au
magnitude: 3.18703 debye
