program: Orca
programVersion: 5.0.2
elementType: S O O O O C C C C C C C C C C C C C C C C C C C C C C C H H H H H H H H H H H H H H H H H H H H H H H H
charge: 0
multiplicity: 1
keywords: wb97x-d3
keywords: def2-TZVPP
keywords: def2/J RIJCOSX
keywords: DEFGRID2
keywords: scfconv7
keywords: smallprint printgap noloewdin
keywords: NOSOSCF
formula: C23H24O4S
InChI: InChI=1/C23H24O4S/c1-23(2)19(12-17-8-9-28-22(17)25)20(23)21(24)27-14-16-11-18(26-13-16)10-15-6-4-3-5-7-15/h3-7,11-13,19-20H,8-10,14H2,1-2H3
52 atoms
S  -1.502259 -2.088338 1.00693
O  2.460133 1.136282 0.580087
O  2.625532 2.276086 -1.334496
O  0.620857 -2.456124 2.529422
O  -1.555904 2.883765 -0.161871
C  4.58795 -0.722423 -0.613655
C  3.240618 -1.344634 -0.772891
C  3.4812 0.080439 -1.266974
C  5.118479 -0.366854 0.753608
C  5.672636 -1.19445 -1.554802
C  2.348066 -1.64281 0.365341
C  2.820321 1.277004 -0.692821
C  1.04596 -1.889537 0.230953
C  0.238698 -1.848472 -1.025956
C  0.223771 -2.191612 1.428789
C  -1.172261 -1.402737 -0.643079
C  1.776507 2.232684 1.198066
C  0.335089 2.295779 0.833312
C  -0.757636 1.623552 1.469117
C  -0.221073 3.038444 -0.153218
C  -1.882678 2.021696 0.828572
C  -3.324559 1.701302 1.012875
C  -3.871466 0.703805 0.016478
C  -4.360859 -0.52256 0.45115
C  -3.895907 0.985974 -1.347245
C  -4.855838 -1.453807 -0.451544
C  -4.387887 0.057642 -2.2515
C  -4.867903 -1.16717 -1.807396
H  3.145801 -2.052759 -1.592087
H  3.574298 0.184553 -2.341675
H  5.639508 -1.226556 1.178673
H  5.840212 0.447973 0.677596
H  4.353224 -0.061953 1.46086
H  5.276878 -1.457368 -2.536576
H  6.429532 -0.421949 -1.698964
H  6.169888 -2.078554 -1.152095
H  2.773447 -1.684523 1.361986
H  0.201758 -2.845108 -1.477083
H  0.662802 -1.169676 -1.767598
H  -1.932856 -1.756467 -1.335727
H  -1.237731 -0.31763 -0.586988
H  1.887287 2.053257 2.266559
H  2.279311 3.170424 0.95796
H  -0.707336 0.935122 2.297783
H  0.203555 3.695165 -0.894179
H  -3.451176 1.308727 2.022486
H  -3.908753 2.625583 0.967199
H  -4.348482 -0.758649 1.50794
H  -3.526866 1.937408 -1.708891
H  -5.227545 -2.404032 -0.091385
H  -4.399989 0.292942 -3.307829
H  -5.253494 -1.890071 -2.514267
totalener: -1590.07654882 hartree
nucrepener: 2873.97827362 hartree
electener: -4464.05482244 hartree
oneelecener: -7887.66286035 hartree
twoeener: 3423.60803791 hartree
kineticenergy: 1584.29018467 hartree
xcener: -135.018661623987 hartree
chargesum: 0.0000000
charge: -0.060364 -0.259294 -0.375294 -0.327247 -0.262590 0.117893 -0.056925 -0.127258 -0.280572 -0.242210 -0.044014 0.365776 -0.123646 -0.165615 0.226443 -0.104433 0.032540 -0.026656 -0.357870 0.005308 0.249798 -0.107373 0.068959 -0.229690 -0.166818 -0.078307 -0.099945 -0.170817 0.100658 0.090151 0.096016 0.096341 0.091825 0.072819 0.094936 0.090089 0.119040 0.102789 0.087389 0.115826 0.100181 0.099859 0.119417 0.144528 0.151277 0.092768 0.112470 0.121523 0.117858 0.129978 0.126627 0.125854
qa: -0.0604 -0.2593 -0.3753 -0.3272 -0.2626 0.1179 -0.0569 -0.1273 -0.2806 -0.2422 -0.0440 0.3658 -0.1236 -0.1656 0.2264 -0.1044 0.0325 -0.0267 -0.3579 0.0053 0.2498 -0.1074 0.0690 -0.2297 -0.1668 -0.0783 -0.0999 -0.1708 0.1007 0.0902 0.0960 0.0963 0.0918 0.0728 0.0949 0.0901 0.1190 0.1028 0.0874 0.1158 0.1002 0.0999 0.1194 0.1445 0.1513 0.0928 0.1125 0.1215 0.1179 0.1300 0.1266 0.1259
va: 2.4206 2.0973 2.1319 2.1659 2.3023 3.7700 3.7981 3.8679 3.9157 3.9080 3.8291 4.1938 3.5973 4.0549 4.2601 3.9390 3.8727 3.6316 4.0001 3.9809 3.5435 3.8466 3.5959 3.9388 3.9708 3.8854 3.9062 3.9498 1.0060 1.0278 1.0002 1.0023 1.0161 1.0076 1.0040 1.0042 1.0253 1.0039 1.0042 1.0137 1.0044 0.9990 1.0055 1.0165 1.0145 1.0139 1.0030 1.0146 1.0251 1.0004 1.0003 1.0017
dispcorr: -0.033243492 hartree
energy: -1590.109792310202
dipole: 13.64002 -13.32993 0.31010 -2.81459 2.89633 0.08174 -7.89817 7.00862 -0.88955
magnitude: 0.94559 au
magnitude: 2.40349 debye
