program: Orca
programVersion: 5.0.2
elementType: S O O O O C C C C C C C C C C C C C C C C C C C C C C C H H H H H H H H H H H H H H H H H H H H H H H H
charge: 0
multiplicity: 1
keywords: wb97x-d3
keywords: def2-TZVPP
keywords: def2/J RIJCOSX
keywords: DEFGRID2
keywords: scfconv7
keywords: smallprint printgap noloewdin
keywords: NOSOSCF
formula: C23H24O4S
InChI: InChI=1/C23H24O4S/c1-23(2)19(12-17-8-9-28-22(17)25)20(23)21(24)27-14-16-11-18(26-13-16)10-15-6-4-3-5-7-15/h3-7,11-13,19-20H,8-10,14H2,1-2H3
52 atoms
S  -1.000413 -2.656067 1.777326
O  1.800216 2.275477 -1.3588
O  3.033811 1.882133 0.463153
O  0.973275 -1.290137 2.875362
O  -1.011681 1.303796 1.857007
C  4.40079 -0.400247 -1.084048
C  2.998324 -0.917889 -0.951672
C  3.266894 0.498118 -1.483138
C  5.255923 -0.141809 0.132788
C  5.198463 -0.959635 -2.241209
C  2.327201 -1.094115 0.344174
C  2.733879 1.618169 -0.670429
C  1.097243 -1.591736 0.490948
C  0.139178 -2.023503 -0.571627
C  0.524432 -1.722079 1.854539
C  -0.755411 -3.104373 0.034174
C  0.959421 3.160159 -0.603525
C  -0.037329 2.396595 0.195194
C  -1.296842 1.88361 -0.256242
C  0.075282 1.999451 1.485782
C  -1.846297 1.2344 0.798239
C  -3.136628 0.520643 1.003881
C  -3.942106 0.471666 -0.264114
C  -4.774568 1.528411 -0.617468
C  -3.8452 -0.615327 -1.125292
C  -5.493848 1.499486 -1.802776
C  -4.561298 -0.64978 -2.31252
C  -5.388241 0.409636 -2.654723
H  2.668857 -1.6034 -1.726114
H  3.093536 0.611599 -2.547436
H  5.748085 -1.06834 0.432988
H  6.035037 0.582539 -0.10816
H  4.71274 0.249509 0.985643
H  5.678952 -1.897527 -1.958464
H  4.574836 -1.157245 -3.114455
H  5.980481 -0.26201 -2.544887
H  2.853946 -0.800139 1.244286
H  0.636112 -2.397836 -1.467566
H  -0.469712 -1.165443 -0.874646
H  -0.283676 -4.085583 -0.017863
H  -1.72201 -3.166989 -0.462187
H  1.561477 3.812648 0.029484
H  0.465092 3.776628 -1.352833
H  -1.735768 1.998533 -1.234347
H  0.852403 2.119452 2.22211
H  -2.936628 -0.492039 1.367965
H  -3.709881 1.018533 1.792639
H  -4.859955 2.38284 0.043395
H  -3.204369 -1.447119 -0.856952
H  -6.140401 2.328101 -2.060492
H  -4.476165 -1.505999 -2.968958
H  -5.951014 0.384578 -3.578488
totalener: -1590.07683954 hartree
nucrepener: 2840.80149865 hartree
electener: -4430.87833818 hartree
oneelecener: -7821.39267202 hartree
twoeener: 3390.51433384 hartree
kineticenergy: 1584.28050229 hartree
xcener: -135.012047117461 hartree
chargesum: -0.0000000
charge: -0.046814 -0.261388 -0.386057 -0.311746 -0.241750 0.123105 -0.057063 -0.069453 -0.255153 -0.241704 -0.019045 0.332992 -0.183645 -0.136272 0.236168 -0.168937 0.056073 -0.047051 -0.274543 -0.005658 0.141965 -0.081485 0.019426 -0.135084 -0.113703 -0.134453 -0.158806 -0.110483 0.083661 0.083150 0.088695 0.086366 0.104802 0.092272 0.070704 0.093887 0.132081 0.084674 0.092563 0.117228 0.106424 0.115325 0.102679 0.135155 0.154785 0.102807 0.099054 0.112850 0.098849 0.126238 0.120007 0.126305
qa: -0.0468 -0.2614 -0.3861 -0.3117 -0.2417 0.1231 -0.0571 -0.0695 -0.2552 -0.2417 -0.0190 0.3330 -0.1836 -0.1363 0.2362 -0.1689 0.0561 -0.0471 -0.2745 -0.0057 0.1420 -0.0815 0.0194 -0.1351 -0.1137 -0.1345 -0.1588 -0.1105 0.0837 0.0831 0.0887 0.0864 0.1048 0.0923 0.0707 0.0939 0.1321 0.0847 0.0926 0.1172 0.1064 0.1153 0.1027 0.1352 0.1548 0.1028 0.0991 0.1128 0.0988 0.1262 0.1200 0.1263
va: 2.4050 2.1288 2.0975 2.1747 2.3016 3.7886 3.8225 3.8492 3.9009 3.8984 3.7950 4.2386 3.6362 3.9398 4.1986 3.9846 3.8673 3.6226 3.9574 3.9562 3.6741 3.8249 3.6336 3.9636 3.9403 3.9700 4.0126 3.9411 1.0107 1.0311 1.0000 1.0031 1.0246 1.0047 1.0067 1.0052 1.0285 1.0168 1.0191 1.0016 0.9980 1.0094 0.9925 1.0115 1.0149 1.0335 1.0122 1.0106 0.9984 1.0000 1.0030 0.9992
dispcorr: -0.031347984 hartree
energy: -1590.108187519846
dipole: 9.98293 -10.11499 -0.13206 -3.11807 2.84043 -0.27764 -16.21200 14.03077 -2.18124
magnitude: 2.20280 au
magnitude: 5.59907 debye
