program: Orca
programVersion: 5.0.2
elementType: S O O O O C C C C C C C C C C C C C C C C C C C C C C C H H H H H H H H H H H H H H H H H H H H H H H H
charge: 0
multiplicity: 1
keywords: wb97x-d3
keywords: def2-TZVPP
keywords: def2/J RIJCOSX
keywords: DEFGRID2
keywords: scfconv7
keywords: smallprint printgap noloewdin
keywords: NOSOSCF
formula: C23H24O4S
InChI: InChI=1/C23H24O4S/c1-23(2)19(12-17-8-9-28-22(17)25)20(23)21(24)27-14-16-11-18(26-13-16)10-15-6-4-3-5-7-15/h3-7,11-13,19-20H,8-10,14H2,1-2H3
52 atoms
S  -1.242893 -2.408274 1.602488
O  2.0264 1.853559 -1.486809
O  3.150949 1.831459 0.445562
O  0.777585 -1.442568 3.002679
O  -0.973988 1.844309 1.775146
C  4.645103 -0.654275 -0.579546
C  3.241054 -1.190896 -0.573479
C  3.568035 0.158705 -1.229816
C  5.331287 -0.236624 0.699108
C  5.591972 -1.333095 -1.544624
C  2.391622 -1.222504 0.6247
C  2.934072 1.364986 -0.640727
C  1.186573 -1.795857 0.658412
C  0.473626 -2.489598 -0.459174
C  0.40388 -1.784187 1.919207
C  -1.025507 -2.350611 -0.199866
C  1.1782 2.894887 -0.986047
C  0.129399 2.370193 -0.071345
C  -1.119066 1.763313 -0.427878
C  0.154917 2.377346 1.281885
C  -1.751509 1.473242 0.735136
C  -3.08421 0.903983 1.082638
C  -3.889908 0.504874 -0.123697
C  -4.238233 -0.824183 -0.333651
C  -4.324956 1.458248 -1.041531
C  -4.991729 -1.198376 -1.43752
C  -5.074367 1.088693 -2.147079
C  -5.40867 -0.243248 -2.350424
H  3.0360 -1.977784 -1.291449
H  3.536089 0.139885 -2.313619
H  5.781333 -1.112255 1.169775
H  6.133012 0.468647 0.476582
H  4.680072 0.24264 1.42152
H  6.405124 -0.661804 -1.82511
H  6.033709 -2.220716 -1.089151
H  5.091228 -1.646616 -2.461916
H  2.746718 -0.743347 1.529592
H  0.74525 -3.549273 -0.473643
H  0.722634 -2.072524 -1.4353
H  -1.599794 -3.153087 -0.658113
H  -1.403613 -1.399086 -0.57218
H  1.773247 3.66591 -0.494618
H  0.72945 3.332461 -1.877004
H  -1.496589 1.586708 -1.422158
H  0.892674 2.707406 1.994207
H  -2.94638 0.039401 1.737829
H  -3.643695 1.641784 1.669052
H  -3.92544 -1.573914 0.383456
H  -4.075134 2.501297 -0.887588
H  -5.257138 -2.237943 -1.578753
H  -5.403953 1.842996 -2.84965
H  -5.997532 -0.53165 -3.211106
totalener: -1590.07767914 hartree
nucrepener: 2833.98728867 hartree
electener: -4424.06496780 hartree
oneelecener: -7807.75150683 hartree
twoeener: 3383.68653903 hartree
kineticenergy: 1584.28009506 hartree
xcener: -135.013050037373 hartree
chargesum: 0.0000000
charge: -0.075064 -0.257674 -0.385795 -0.312855 -0.244291 0.120789 -0.040760 -0.078119 -0.250234 -0.242724 -0.066838 0.343041 -0.155158 -0.168444 0.257039 -0.132941 0.050186 -0.050447 -0.295288 0.001232 0.181188 -0.090826 0.087985 -0.209911 -0.234781 -0.115764 -0.099189 -0.140893 0.087625 0.084378 0.087971 0.086860 0.103019 0.093547 0.092346 0.070822 0.130783 0.101959 0.082411 0.114015 0.098906 0.115738 0.102446 0.140312 0.148597 0.112569 0.110294 0.136729 0.127833 0.124969 0.126521 0.125886
qa: -0.0751 -0.2577 -0.3858 -0.3129 -0.2443 0.1208 -0.0408 -0.0781 -0.2502 -0.2427 -0.0668 0.3430 -0.1552 -0.1684 0.2570 -0.1329 0.0502 -0.0504 -0.2953 0.0012 0.1812 -0.0908 0.0880 -0.2099 -0.2348 -0.1158 -0.0992 -0.1409 0.0876 0.0844 0.0880 0.0869 0.1030 0.0935 0.0923 0.0708 0.1308 0.1020 0.0824 0.1140 0.0989 0.1157 0.1024 0.1403 0.1486 0.1126 0.1103 0.1367 0.1278 0.1250 0.1265 0.1259
va: 2.3946 2.1292 2.1043 2.1807 2.3058 3.7977 3.8121 3.8453 3.9020 3.9001 3.8583 4.2347 3.6285 4.0209 4.2135 3.9615 3.8701 3.6404 3.9608 3.9765 3.6503 3.8495 3.5151 3.9736 4.0004 3.9796 3.9291 3.9839 1.0074 1.0301 1.0006 1.0030 1.0244 1.0051 1.0048 1.0063 1.0302 1.0020 1.0060 1.0079 1.0050 1.0084 0.9931 1.0116 1.0139 1.0201 1.0052 0.9981 1.0060 1.0015 0.9992 0.9996
dispcorr: -0.030940204 hartree
energy: -1590.108619340210
dipole: 11.41752 -11.36067 0.05685 -4.05393 3.81837 -0.23556 -13.81605 11.61330 -2.20275
magnitude: 2.21604 au
magnitude: 5.63272 debye
