program: Orca
programVersion: 5.0.2
elementType: S O O O O C C C C C C C C C C C C C C C C C C C C C C C H H H H H H H H H H H H H H H H H H H H H H H H
charge: 0
multiplicity: 1
keywords: wb97x-d3
keywords: def2-TZVPP
keywords: def2/J RIJCOSX
keywords: DEFGRID2
keywords: scfconv7
keywords: smallprint printgap noloewdin
keywords: NOSOSCF
formula: C23H24O4S
InChI: InChI=1/C23H24O4S/c1-23(2)19(12-17-8-9-28-22(17)25)20(23)21(24)27-14-16-11-18(26-13-16)10-15-6-4-3-5-7-15/h3-7,11-13,19-20H,8-10,14H2,1-2H3
52 atoms
S  0.088925 1.49418 -3.855699
O  2.323543 1.333485 0.705603
O  1.87264 0.287072 2.635458
O  -1.295173 0.005708 -2.182162
O  -1.764451 2.522476 -0.449846
C  2.372949 -2.271148 0.940956
C  2.359627 -1.531091 -0.373471
C  2.960256 -0.898855 0.868343
C  1.072285 -2.509129 1.670038
C  3.347207 -3.417251 1.07216
C  1.117581 -1.009445 -0.977044
C  2.314924 0.278554 1.520259
C  1.098666 -0.125949 -1.976623
C  2.274788 0.561278 -2.590005
C  -0.196155 0.333513 -2.532415
C  1.858586 1.098963 -3.959885
C  1.552695 2.482899 1.08833
C  0.136417 2.311962 0.672273
C  -0.811749 1.366597 1.178894
C  -0.504919 2.974184 -0.319396
C  -1.939667 1.532115 0.449662
C  -3.256289 0.836938 0.468526
C  -3.155594 -0.475807 1.198211
C  -3.393418 -0.550857 2.565484
C  -2.77765 -1.631047 0.519408
C  -3.253066 -1.7523 3.245926
C  -2.644686 -2.834083 1.195278
C  -2.879192 -2.898476 2.561659
H  3.10195 -1.842855 -1.104263
H  4.045254 -0.828467 0.869956
H  1.250937 -2.626852 2.738493
H  0.34175 -1.710378 1.559239
H  0.605968 -3.425225 1.303446
H  3.608875 -3.584637 2.118143
H  2.91479 -4.340879 0.684136
H  4.273226 -3.230724 0.525763
H  0.164807 -1.36468 -0.597473
H  3.1395 -0.097747 -2.686002
H  2.577695 1.385701 -1.940539
H  2.007441 0.35579 -4.742914
H  2.412432 1.994543 -4.234185
H  1.641245 2.657416 2.161446
H  2.010949 3.32316 0.567209
H  -0.667851 0.66043 1.979125
H  -0.199503 3.759668 -0.991851
H  -4.014118 1.471772 0.939352
H  -3.585308 0.67198 -0.559963
H  -3.687771 0.341177 3.105934
H  -2.579959 -1.580718 -0.54378
H  -3.439257 -1.792664 4.31117
H  -2.357722 -3.72545 0.652094
H  -2.774756 -3.837598 3.088978
totalener: -1590.07316181 hartree
nucrepener: 2938.39815917 hartree
electener: -4528.47132097 hartree
oneelecener: -8017.22206874 hartree
twoeener: 3488.75074776 hartree
kineticenergy: 1584.28134949 hartree
xcener: -135.013543439174 hartree
chargesum: -0.0000000
charge: -0.041159 -0.259288 -0.346377 -0.345506 -0.244548 0.097385 -0.063239 -0.028738 -0.222126 -0.245857 -0.050375 0.284192 -0.125157 -0.138619 0.262780 -0.134866 0.035257 -0.036981 -0.263614 -0.062036 0.184781 -0.051880 0.037382 -0.173234 -0.172741 -0.106099 -0.167209 -0.111219 0.086287 0.080222 0.102802 0.032322 0.088828 0.096075 0.088539 0.068480 0.123799 0.078949 0.094900 0.101696 0.100496 0.127589 0.097350 0.167354 0.131697 0.094225 0.106475 0.110334 0.139923 0.123119 0.125424 0.122205
qa: -0.0412 -0.2593 -0.3464 -0.3455 -0.2445 0.0974 -0.0632 -0.0287 -0.2221 -0.2459 -0.0504 0.2842 -0.1252 -0.1386 0.2628 -0.1349 0.0353 -0.0370 -0.2636 -0.0620 0.1848 -0.0519 0.0374 -0.1732 -0.1727 -0.1061 -0.1672 -0.1112 0.0863 0.0802 0.1028 0.0323 0.0888 0.0961 0.0885 0.0685 0.1238 0.0789 0.0949 0.1017 0.1005 0.1276 0.0974 0.1674 0.1317 0.0942 0.1065 0.1103 0.1399 0.1231 0.1254 0.1222
va: 2.4138 2.1062 2.1419 2.1472 2.2970 3.8889 3.8250 3.8023 3.9335 3.8956 3.7708 4.2829 3.5822 3.9584 4.1538 3.9836 3.8593 3.6697 3.9201 3.9618 3.6653 3.8514 3.6578 3.9878 3.9004 3.9492 3.9232 3.9225 1.0064 1.0197 1.0129 1.0146 1.0026 1.0042 1.0048 1.0069 1.0051 1.0104 1.0188 1.0007 1.0058 1.0067 0.9985 1.0004 1.0151 1.0042 1.0183 1.0106 1.0222 0.9996 1.0019 0.9996
dispcorr: -0.035360427 hartree
energy: -1590.108522232783
dipole: 9.92565 -8.27789 1.64776 -16.22666 16.04581 -0.18085 8.81692 -9.20791 -0.39099
magnitude: 1.70314 au
magnitude: 4.32905 debye
