program: Orca
programVersion: 5.0.2
elementType: S O O O O C C C C C C C C C C C C C C C C C C C C C C C H H H H H H H H H H H H H H H H H H H H H H H H
charge: 0
multiplicity: 1
keywords: wb97x-d3
keywords: def2-TZVPP
keywords: def2/J RIJCOSX
keywords: DEFGRID2
keywords: scfconv7
keywords: smallprint printgap noloewdin
keywords: NOSOSCF
formula: C23H24O4S
InChI: InChI=1/C23H24O4S/c1-23(2)19(12-17-8-9-28-22(17)25)20(23)21(24)27-14-16-11-18(26-13-16)10-15-6-4-3-5-7-15/h3-7,11-13,19-20H,8-10,14H2,1-2H3
52 atoms
S  -1.120293 -2.252635 -1.840643
O  2.232937 1.349438 0.948342
O  3.129503 2.260507 -0.884212
O  -0.56907 -2.423492 0.733343
O  -1.212553 1.981452 -1.699973
C  4.479986 -0.659381 1.034651
C  3.544185 -1.201115 0.004191
C  4.043159 0.243405 -0.094069
C  4.033976 -0.461526 2.463486
C  5.918956 -1.117577 0.942104
C  2.127093 -1.510441 0.274868
C  3.102772 1.388876 -0.054255
C  1.239113 -1.734475 -0.694391
C  1.477552 -1.641648 -2.167733
C  -0.141148 -2.152524 -0.353063
C  0.127769 -1.396566 -2.845991
C  1.232726 2.3780 0.993054
C  0.086635 2.084888 0.091669
C  -1.122093 1.396205 0.429671
C  -0.032729 2.412942 -1.216647
C  -1.877002 1.367741 -0.692815
C  -3.22064 0.808935 -1.009674
C  -3.998571 0.47172 0.233592
C  -3.786785 -0.730924 0.899506
C  -4.929679 1.367074 0.747811
C  -4.494111 -1.031327 2.054224
C  -5.642744 1.066908 1.89853
C  -5.42593 -0.134761 2.555765
H  3.98908 -1.845447 -0.749788
H  4.786428 0.404127 -0.866202
H  4.224399 -1.375281 3.029164
H  4.60859 0.339159 2.93113
H  2.983375 -0.215171 2.5751
H  6.589375 -0.383959 1.392411
H  6.055717 -2.063006 1.469383
H  6.238125 -1.266026 -0.090244
H  1.794969 -1.600613 1.302915
H  1.907349 -2.578111 -2.536397
H  2.176776 -0.842056 -2.417509
H  0.099487 -1.787892 -3.860697
H  -0.112155 -0.33496 -2.877514
H  0.903748 2.394607 2.030814
H  1.681941 3.344778 0.764947
H  -1.393878 0.986613 1.389045
H  0.618768 2.933264 -1.899049
H  -3.777984 1.530665 -1.613116
H  -3.10585 -0.087006 -1.628395
H  -3.06088 -1.438204 0.51886
H  -5.101117 2.309164 0.240767
H  -4.316663 -1.971322 2.559743
H  -6.369417 1.771849 2.280731
H  -5.982808 -0.372735 3.452473
totalener: -1590.07754893 hartree
nucrepener: 2845.28569281 hartree
electener: -4435.36324174 hartree
oneelecener: -7830.45054301 hartree
twoeener: 3395.08730127 hartree
kineticenergy: 1584.27823714 hartree
xcener: -135.012242562005 hartree
chargesum: -0.0000000
charge: -0.060919 -0.256443 -0.378260 -0.332571 -0.261970 0.138749 -0.085345 -0.110333 -0.262581 -0.243877 -0.038131 0.350036 -0.124075 -0.167580 0.249688 -0.133766 0.031565 -0.030295 -0.238452 -0.028812 0.152552 -0.089077 0.073852 -0.170401 -0.158663 -0.140612 -0.124407 -0.126295 0.096636 0.090524 0.092647 0.094412 0.087208 0.095519 0.090581 0.073033 0.120299 0.104259 0.091622 0.113564 0.108708 0.096933 0.122950 0.139775 0.153573 0.094033 0.106620 0.114869 0.104900 0.129054 0.121599 0.123107
qa: -0.0609 -0.2564 -0.3783 -0.3326 -0.2620 0.1387 -0.0853 -0.1103 -0.2626 -0.2439 -0.0381 0.3500 -0.1241 -0.1676 0.2497 -0.1338 0.0316 -0.0303 -0.2385 -0.0288 0.1526 -0.0891 0.0739 -0.1704 -0.1587 -0.1406 -0.1244 -0.1263 0.0966 0.0905 0.0926 0.0944 0.0872 0.0955 0.0906 0.0730 0.1203 0.1043 0.0916 0.1136 0.1087 0.0969 0.1230 0.1398 0.1536 0.0940 0.1066 0.1149 0.1049 0.1291 0.1216 0.1231
va: 2.3939 2.1100 2.1207 2.1505 2.2796 3.7572 3.8344 3.8540 3.9099 3.9048 3.7808 4.2208 3.6123 3.9853 4.1914 3.9518 3.8618 3.6139 3.9700 3.9416 3.6650 3.8547 3.5607 3.9365 4.0168 4.0069 3.9580 3.9429 1.0057 1.0295 1.0005 1.0035 1.0193 1.0039 1.0046 1.0076 1.0276 1.0033 1.0080 1.0121 1.0122 0.9995 1.0073 1.0105 1.0141 1.0194 1.0139 1.0327 1.0113 0.9993 1.0008 0.9997
dispcorr: -0.031704686 hartree
energy: -1590.109253613072
dipole: 14.69302 -13.53510 1.15792 -1.38445 1.34907 -0.03538 6.98099 -7.15563 -0.17463
magnitude: 1.17155 au
magnitude: 2.97784 debye
