program: Orca
programVersion: 5.0.2
elementType: S O O O O C C C C C C C C C C C C C C C C C C C C C C C H H H H H H H H H H H H H H H H H H H H H H H H
charge: 0
multiplicity: 1
keywords: wb97x-d3
keywords: def2-TZVPP
keywords: def2/J RIJCOSX
keywords: DEFGRID2
keywords: scfconv7
keywords: smallprint printgap noloewdin
keywords: NOSOSCF
formula: C23H24O4S
InChI: InChI=1/C23H24O4S/c1-23(2)19(12-17-8-9-28-22(17)25)20(23)21(24)27-14-16-11-18(26-13-16)10-15-6-4-3-5-7-15/h3-7,11-13,19-20H,8-10,14H2,1-2H3
52 atoms
S  -0.715296 -2.995817 -1.110834
O  2.347365 1.98783 -0.938304
O  2.196836 1.560823 1.25093
O  -0.094226 -2.402939 1.378765
O  -1.898074 0.854425 -1.770927
C  4.73105 -0.148405 1.000575
C  3.808253 -0.913444 0.106726
C  3.966736 0.600591 -0.057157
C  4.438953 0.000895 2.474687
C  6.209411 -0.30095 0.718865
C  2.513172 -1.465428 0.556209
C  2.763086 1.429234 0.199799
C  1.538855 -1.810045 -0.286632
C  1.522375 -1.652035 -1.771891
C  0.266532 -2.368385 0.236178
C  0.583784 -2.713763 -2.34814
C  1.117969 2.725397 -0.89894
C  -0.081564 1.847662 -0.970183
C  -0.670604 1.047657 0.061554
C  -0.87595 1.678812 -2.055519
C  -1.769905 0.47245 -0.479257
C  -2.839994 -0.38341 0.09944
C  -3.97969 0.432557 0.662711
C  -4.91367 1.031529 -0.177039
C  -4.100647 0.616704 2.034914
C  -5.945913 1.794963 0.345407
C  -5.132073 1.380429 2.561456
C  -6.0586 1.972106 1.717139
H  4.275798 -1.481525 -0.693592
H  4.526767 0.905485 -0.934323
H  4.903016 0.909418 2.860039
H  3.38302 0.055629 2.717268
H  4.87136 -0.84436 3.013074
H  6.762579 0.568608 1.077102
H  6.608077 -1.181451 1.225146
H  6.418272 -0.409297 -0.346649
H  2.342611 -1.603246 1.618254
H  2.514391 -1.735627 -2.217903
H  1.143659 -0.65417 -2.013963
H  1.107746 -3.651494 -2.531824
H  0.123871 -2.390054 -3.279571
H  1.085476 3.355214 -0.008576
H  1.159994 3.37698 -1.771352
H  -0.321464 0.92878 1.073155
H  -0.837911 2.081057 -3.055653
H  -3.2059 -1.078446 -0.659707
H  -2.399095 -0.993137 0.889248
H  -4.83325 0.899341 -1.249351
H  -3.380742 0.154669 2.700117
H  -6.66687 2.251845 -0.320177
H  -5.212412 1.510168 3.632943
H  -6.866238 2.565493 2.125208
totalener: -1590.07678450 hartree
nucrepener: 2821.07131500 hartree
electener: -4411.14809950 hartree
oneelecener: -7782.29503474 hartree
twoeener: 3371.14693524 hartree
kineticenergy: 1584.27313935 hartree
xcener: -135.010622238029 hartree
chargesum: -0.0000000
charge: -0.042366 -0.256387 -0.381099 -0.332129 -0.250941 0.125677 -0.091749 -0.084085 -0.259027 -0.244112 -0.030230 0.346337 -0.125852 -0.134084 0.229152 -0.129962 0.049651 -0.091443 -0.252611 -0.037472 0.255529 -0.134441 0.054714 -0.180955 -0.158916 -0.129205 -0.124966 -0.129157 0.087286 0.082263 0.088794 0.099631 0.088662 0.094364 0.091483 0.069621 0.122641 0.083371 0.098764 0.107163 0.103354 0.118925 0.095468 0.158447 0.134097 0.111301 0.113903 0.110508 0.113182 0.121466 0.122470 0.122967
qa: -0.0424 -0.2564 -0.3811 -0.3321 -0.2509 0.1257 -0.0917 -0.0841 -0.2590 -0.2441 -0.0302 0.3463 -0.1259 -0.1341 0.2292 -0.1300 0.0497 -0.0914 -0.2526 -0.0375 0.2555 -0.1344 0.0547 -0.1810 -0.1589 -0.1292 -0.1250 -0.1292 0.0873 0.0823 0.0888 0.0996 0.0887 0.0944 0.0915 0.0696 0.1226 0.0834 0.0988 0.1072 0.1034 0.1189 0.0955 0.1584 0.1341 0.1113 0.1139 0.1105 0.1132 0.1215 0.1225 0.1230
va: 2.4118 2.1210 2.1034 2.1508 2.2899 3.7928 3.8845 3.8152 3.9109 3.9030 3.7754 4.1944 3.6195 3.9641 4.2142 3.9745 3.9027 3.6694 3.9523 3.9727 3.4954 3.7977 3.7109 4.0175 3.9892 3.9658 3.9660 3.9563 1.0087 1.0328 1.0048 1.0215 0.9988 1.0049 1.0049 1.0066 1.0245 1.0117 1.0237 1.0035 1.0070 1.0041 0.9969 1.0246 1.0085 1.0158 1.0216 1.0208 1.0109 1.0011 1.0016 1.0001
dispcorr: -0.031061689 hartree
energy: -1590.107846186229
dipole: 16.44472 -15.01218 1.43253 3.27346 -2.95403 0.31943 2.97063 -4.46021 -1.48958
magnitude: 2.09118 au
magnitude: 5.31536 debye
