program: Orca
programVersion: 5.0.2
elementType: S O O O O C C C C C C C C C C C C C C C C C C C C C C C H H H H H H H H H H H H H H H H H H H H H H H H
charge: 0
multiplicity: 1
keywords: wb97x-d3
keywords: def2-TZVPP
keywords: def2/J RIJCOSX
keywords: DEFGRID2
keywords: scfconv7
keywords: smallprint printgap noloewdin
keywords: NOSOSCF
formula: C23H24O4S
InChI: InChI=1/C23H24O4S/c1-23(2)19(12-17-8-9-28-22(17)25)20(23)21(24)27-14-16-11-18(26-13-16)10-15-6-4-3-5-7-15/h3-7,11-13,19-20H,8-10,14H2,1-2H3
52 atoms
S  -0.194568 -3.425401 -3.459007
O  2.209177 1.408589 -0.88897
O  2.925335 2.422652 0.974492
O  -1.06764 -1.188341 -2.39378
O  -1.259975 3.493206 0.617007
C  1.966466 -0.516523 1.895708
C  2.136788 -1.179496 0.54232
C  2.930202 0.06043 0.906083
C  0.702679 0.246568 2.216133
C  2.54573 -1.240853 3.085515
C  1.06031 -1.200406 -0.450455
C  2.689983 1.42428 0.351017
C  0.960043 -2.084723 -1.448854
C  1.93518 -3.151202 -1.841289
C  -0.208894 -2.02864 -2.355128
C  1.162752 -4.2472 -2.576437
C  1.671318 2.641697 -1.392758
C  0.33326 2.863878 -0.788316
C  -0.850698 2.108286 -1.060111
C  0.01728 3.684294 0.241119
C  -1.78021 2.525872 -0.170546
C  -3.140751 2.02354 0.156917
C  -3.071246 0.938788 1.207971
C  -2.852497 -0.383546 0.833108
C  -3.171143 1.245793 2.55974
C  -2.754325 -1.380838 1.79081
C  -3.06631 0.250107 3.520589
C  -2.862544 -1.067416 3.138648
H  2.744543 -2.078724 0.553501
H  3.98194 -0.109329 1.117059
H  0.267926 0.77244 1.366886
H  -0.067073 -0.42192 2.602771
H  0.910539 0.998634 2.978022
H  3.454218 -1.78848 2.829991
H  2.796733 -0.536444 3.880144
H  1.827558 -1.956875 3.488535
H  0.257393 -0.479353 -0.348793
H  2.467218 -3.575836 -0.989132
H  2.689634 -2.72625 -2.50937
H  0.744001 -4.973197 -1.879811
H  1.785897 -4.780472 -3.291472
H  2.350808 3.471906 -1.19711
H  1.604644 2.494538 -2.469567
H  -0.975502 1.329513 -1.796297
H  0.587833 4.413501 0.7924
H  -3.777873 2.843295 0.496532
H  -3.592709 1.628221 -0.75397
H  -2.751167 -0.635987 -0.216097
H  -3.332594 2.272581 2.8655
H  -2.593218 -2.405455 1.481775
H  -3.14739 0.50452 4.569411
H  -2.789438 -1.845915 3.886884
totalener: -1590.07649669 hartree
nucrepener: 2866.36276077 hartree
electener: -4456.43925746 hartree
oneelecener: -7872.75868812 hartree
twoeener: 3416.31943066 hartree
kineticenergy: 1584.28008239 hartree
xcener: -135.013215922178 hartree
chargesum: -0.0000000
charge: -0.030324 -0.246533 -0.351391 -0.366657 -0.248050 0.083308 0.031387 -0.000975 -0.213057 -0.242985 -0.027886 0.260760 -0.153432 -0.164549 0.255522 -0.135865 0.041472 -0.047260 -0.352543 0.004549 0.235394 -0.119261 0.074806 -0.187521 -0.149504 -0.125958 -0.112136 -0.156804 0.078781 0.081958 0.015553 0.098536 0.106842 0.069220 0.095731 0.089415 0.066499 0.078849 0.100206 0.100727 0.102291 0.113164 0.106967 0.169491 0.145207 0.101365 0.109772 0.134987 0.109707 0.123423 0.123429 0.123373
qa: -0.0303 -0.2465 -0.3514 -0.3667 -0.2480 0.0833 0.0314 -0.0010 -0.2131 -0.2430 -0.0279 0.2608 -0.1534 -0.1645 0.2555 -0.1359 0.0415 -0.0473 -0.3525 0.0045 0.2354 -0.1193 0.0748 -0.1875 -0.1495 -0.1260 -0.1121 -0.1568 0.0788 0.0820 0.0156 0.0985 0.1068 0.0692 0.0957 0.0894 0.0665 0.0788 0.1002 0.1007 0.1023 0.1132 0.1070 0.1695 0.1452 0.1014 0.1098 0.1350 0.1097 0.1234 0.1234 0.1234
va: 2.4328 2.1334 2.1425 2.1124 2.3054 3.8590 3.6976 3.7854 3.9446 3.8855 3.8652 4.3415 3.6715 3.9766 4.1760 3.9766 3.8922 3.6680 3.9529 3.9720 3.6077 3.8659 3.6189 3.9308 4.0027 3.9101 3.9267 3.9297 1.0083 1.0181 1.0049 1.0023 1.0114 1.0082 1.0047 1.0033 0.9965 1.0111 1.0004 1.0006 1.0077 1.0085 0.9948 1.0254 1.0115 1.0154 1.0102 1.0143 1.0141 1.0027 1.0004 1.0010
dispcorr: -0.033019569 hartree
energy: -1590.109516260085
dipole: 5.13417 -4.20311 0.93106 -6.87600 5.77509 -1.10091 16.22054 -15.78092 0.43962
magnitude: 1.50736 au
magnitude: 3.83141 debye
