program: Orca
programVersion: 5.0.2
elementType: S O O O O C C C C C C C C C C C C C C C C C C C C C C C H H H H H H H H H H H H H H H H H H H H H H H H
charge: 0
multiplicity: 1
keywords: wb97x-d3
keywords: def2-TZVPP
keywords: def2/J RIJCOSX
keywords: DEFGRID2
keywords: scfconv7
keywords: smallprint printgap noloewdin
keywords: NOSOSCF
formula: C23H24O4S
InChI: InChI=1/C23H24O4S/c1-23(2)19(12-17-8-9-28-22(17)25)20(23)21(24)27-14-16-11-18(26-13-16)10-15-6-4-3-5-7-15/h3-7,11-13,19-20H,8-10,14H2,1-2H3
52 atoms
S  -0.700845 -2.792303 -1.403072
O  2.386462 1.856657 -0.851387
O  2.27288 1.465408 1.346315
O  -0.018903 -2.785071 1.145781
O  -1.993192 1.053658 -1.586897
C  4.754925 -0.305204 1.076629
C  3.848983 -1.03364 0.134684
C  4.024169 0.485275 0.027402
C  4.432446 -0.203907 2.548604
C  6.237738 -0.465215 0.822784
C  2.530438 -1.577184 0.517568
C  2.820715 1.314807 0.287938
C  1.619412 -1.927451 -0.391733
C  1.760617 -1.816817 -1.876234
C  0.320626 -2.509623 0.030131
C  0.356623 -1.784601 -2.480685
C  1.194539 2.652147 -0.789745
C  -0.051436 1.841518 -0.851745
C  -0.601228 0.955002 0.131568
C  -0.94721 1.850604 -1.867893
C  -1.777737 0.509762 -0.368034
C  -2.839191 -0.370523 0.185429
C  -4.057053 0.416408 0.60604
C  -4.141103 0.955296 1.885262
C  -5.098931 0.644926 -0.285288
C  -5.244058 1.702731 2.268073
C  -6.203374 1.394101 0.092932
C  -6.279346 1.925277 1.371701
H  4.333802 -1.580136 -0.669616
H  4.605908 0.815723 -0.826239
H  4.856158 -1.065774 3.066978
H  4.885528 0.692542 2.97301
H  3.372162 -0.159948 2.772896
H  6.790828 0.390661 1.212382
H  6.617574 -1.360802 1.316685
H  6.468329 -0.551424 -0.240212
H  2.289233 -1.700072 1.567504
H  2.308051 -2.681449 -2.263616
H  2.312872 -0.921264 -2.164666
H  0.332618 -2.191824 -3.489355
H  -0.033039 -0.768411 -2.507474
H  1.207594 3.273012 0.107453
H  1.254901 3.31102 -1.655684
H  -0.178199 0.697189 1.08734
H  -0.972209 2.371682 -2.811952
H  -3.111976 -1.129613 -0.551539
H  -2.417987 -0.909604 1.035466
H  -3.334558 0.787026 2.589214
H  -5.046878 0.231263 -1.28528
H  -5.296386 2.110052 3.269435
H  -7.007114 1.561342 -0.612381
H  -7.141631 2.507111 1.669664
totalener: -1590.07750570 hartree
nucrepener: 2818.66567104 hartree
electener: -4408.74317674 hartree
oneelecener: -7777.27636605 hartree
twoeener: 3368.53318932 hartree
kineticenergy: 1584.27738669 hartree
xcener: -135.011601387662 hartree
chargesum: -0.0000000
charge: -0.058405 -0.255813 -0.380626 -0.327528 -0.254694 0.128173 -0.076056 -0.100849 -0.250879 -0.245984 -0.051144 0.345596 -0.120951 -0.170258 0.247390 -0.132017 0.048396 -0.050171 -0.284789 -0.050236 0.233086 -0.113136 0.079419 -0.165210 -0.169409 -0.129811 -0.128737 -0.128546 0.093579 0.087151 0.088556 0.089921 0.094866 0.095034 0.092147 0.070352 0.125862 0.105138 0.089187 0.113850 0.107438 0.119439 0.094741 0.157669 0.131402 0.105953 0.116410 0.111323 0.106000 0.122391 0.121387 0.123393
qa: -0.0584 -0.2558 -0.3806 -0.3275 -0.2547 0.1282 -0.0761 -0.1008 -0.2509 -0.2460 -0.0511 0.3456 -0.1210 -0.1703 0.2474 -0.1320 0.0484 -0.0502 -0.2848 -0.0502 0.2331 -0.1131 0.0794 -0.1652 -0.1694 -0.1298 -0.1287 -0.1285 0.0936 0.0872 0.0886 0.0899 0.0949 0.0950 0.0921 0.0704 0.1259 0.1051 0.0892 0.1138 0.1074 0.1194 0.0947 0.1577 0.1314 0.1060 0.1164 0.1113 0.1060 0.1224 0.1214 0.1234
va: 2.3926 2.1220 2.1034 2.1613 2.2950 3.8079 3.8543 3.8253 3.9096 3.9031 3.7895 4.2111 3.5906 3.9827 4.2053 3.9796 3.9108 3.6545 3.9802 3.9579 3.5224 3.7973 3.6519 4.0017 4.0215 3.9703 3.9631 3.9544 1.0048 1.0306 0.9995 1.0049 1.0224 1.0045 1.0052 1.0061 1.0254 1.0042 1.0120 1.0094 0.9965 1.0034 0.9978 1.0243 1.0083 1.0207 1.0193 1.0121 1.0168 1.0012 1.0011 1.0001
dispcorr: -0.031272470 hartree
energy: -1590.108778170245
dipole: 16.26833 -14.85003 1.41830 3.85343 -3.17741 0.67603 3.61216 -4.97677 -1.36461
magnitude: 2.08105 au
magnitude: 5.28960 debye
