program: Orca
programVersion: 5.0.2
elementType: S O O O O C C C C C C C C C C C C C C C C C C C C C C C H H H H H H H H H H H H H H H H H H H H H H H H
charge: 0
multiplicity: 1
keywords: wb97x-d3
keywords: def2-TZVPP
keywords: def2/J RIJCOSX
keywords: DEFGRID2
keywords: scfconv7
keywords: smallprint printgap noloewdin
keywords: NOSOSCF
formula: C23H24O4S
InChI: InChI=1/C23H24O4S/c1-23(2)19(12-17-8-9-28-22(17)25)20(23)21(24)27-14-16-11-18(26-13-16)10-15-6-4-3-5-7-15/h3-7,11-13,19-20H,8-10,14H2,1-2H3
52 atoms
S  0.015438 1.613183 -3.651584
O  2.312872 1.353922 0.671639
O  1.864766 0.280555 2.587575
O  -1.276418 -0.295548 -2.376298
O  -1.785694 2.478272 -0.535979
C  2.496868 -2.257189 0.916685
C  2.42874 -1.526196 -0.400994
C  3.017315 -0.859483 0.83083
C  1.220594 -2.560765 1.664453
C  3.528818 -3.35348 1.034722
C  1.156314 -1.056265 -0.984492
C  2.325746 0.293074 1.480054
C  1.096651 -0.178276 -1.986126
C  2.248217 0.510854 -2.642104
C  -0.210071 0.221901 -2.561295
C  1.740466 1.862135 -3.143663
C  1.505781 2.476665 1.059439
C  0.102333 2.279694 0.610921
C  -0.826105 1.287439 1.063618
C  -0.543573 2.962853 -0.363299
C  -1.946716 1.449033 0.322578
C  -3.242288 0.71698 0.286552
C  -3.156699 -0.555421 1.085365
C  -3.484787 -0.5714 2.435755
C  -2.698375 -1.72847 0.492598
C  -3.356098 -1.733332 3.183482
C  -2.57399 -2.891996 1.236297
C  -2.900094 -2.897747 2.585199
H  3.171604 -1.810942 -1.141169
H  4.097762 -0.738949 0.815814
H  1.41949 -2.665185 2.730674
H  0.447217 -1.802637 1.561254
H  0.800724 -3.502326 1.30593
H  3.81312 -3.506751 2.076942
H  3.13711 -4.297609 0.652959
H  4.43682 -3.122561 0.475162
H  0.223229 -1.442687 -0.587688
H  2.604862 -0.081799 -3.490164
H  3.085136 0.649111 -1.957802
H  2.316041 2.234562 -3.988766
H  1.771854 2.605186 -2.346613
H  1.56725 2.632135 2.137327
H  1.953309 3.339137 0.565531
H  -0.675996 0.555521 1.839199
H  -0.256516 3.791328 -0.99104
H  -4.045864 1.352579 0.67253
H  -3.495412 0.493786 -0.752738
H  -3.840937 0.335724 2.909761
H  -2.433167 -1.724217 -0.557227
H  -3.614053 -1.728368 4.234414
H  -2.222729 -3.797973 0.759125
H  -2.803395 -3.805874 3.165594
totalener: -1590.07419134 hartree
nucrepener: 2951.14208178 hartree
electener: -4541.21627312 hartree
oneelecener: -8042.47172320 hartree
twoeener: 3501.25545008 hartree
kineticenergy: 1584.28090650 hartree
xcener: -135.014375866680 hartree
chargesum: -0.0000000
charge: -0.039303 -0.255360 -0.345390 -0.346632 -0.242075 0.099092 -0.060840 -0.051314 -0.221285 -0.246713 -0.067092 0.294351 -0.095105 -0.173814 0.260783 -0.138443 0.024781 -0.034141 -0.261341 -0.077098 0.180534 -0.050959 0.032535 -0.160666 -0.181795 -0.115821 -0.166864 -0.105567 0.093440 0.084064 0.102641 0.034799 0.089478 0.096132 0.089208 0.069260 0.122786 0.106567 0.090295 0.112686 0.089235 0.131149 0.100379 0.169018 0.134378 0.094879 0.106962 0.108595 0.148986 0.123041 0.124887 0.122678
qa: -0.0393 -0.2554 -0.3454 -0.3466 -0.2421 0.0991 -0.0608 -0.0513 -0.2213 -0.2467 -0.0671 0.2944 -0.0951 -0.1738 0.2608 -0.1384 0.0248 -0.0341 -0.2613 -0.0771 0.1805 -0.0510 0.0325 -0.1607 -0.1818 -0.1158 -0.1669 -0.1056 0.0934 0.0841 0.1026 0.0348 0.0895 0.0961 0.0892 0.0693 0.1228 0.1066 0.0903 0.1127 0.0892 0.1311 0.1004 0.1690 0.1344 0.0949 0.1070 0.1086 0.1490 0.1230 0.1249 0.1227
va: 2.4171 2.1072 2.1424 2.1476 2.2962 3.8860 3.8229 3.8189 3.9370 3.8972 3.8112 4.2704 3.5225 3.9756 4.1739 3.9831 3.8691 3.6323 3.9276 3.9653 3.6549 3.8509 3.6599 3.9908 3.8944 3.9593 3.9370 3.9261 1.0026 1.0184 1.0127 1.0135 1.0020 1.0040 1.0050 1.0065 1.0049 1.0052 1.0139 1.0101 1.0025 1.0078 0.9971 1.0000 1.0100 1.0060 1.0186 1.0109 1.0227 1.0001 1.0024 0.9993
dispcorr: -0.036104181 hartree
energy: -1590.110295520150
dipole: 10.47988 -8.83956 1.64032 -14.99318 15.07133 0.07815 9.73421 -9.85511 -0.12090
magnitude: 1.64662 au
magnitude: 4.18539 debye
