program: Orca
programVersion: 5.0.2
elementType: O O O O N N C C C C C C C C C C C C C C C C C H H H H H H H H H H H H H H H H H H H H H H
charge: 0
multiplicity: 1
keywords: wb97x-d3
keywords: def2-TZVPP
keywords: def2/J RIJCOSX
keywords: DEFGRID2
keywords: scfconv7
keywords: smallprint printgap noloewdin
keywords: NOSOSCF
formula: C17H22N2O4
InChI: InChI=1/C17H22N2O4/c1-6-7-18-9-13(20)19(16(18)22)10-23-15(21)14-12(8-11(2)3)17(14,4)5/h1,8,12,14H,7,9-10H2,2-5H3
45 atoms
O  0.758295 1.870946 -1.075532
O  1.129814 1.232722 1.034361
O  -1.518808 2.405243 2.020802
O  -1.67016 0.289393 -2.016447
N  -1.40243 1.618876 -0.141486
N  -2.40925 -0.334796 0.074823
C  3.866024 0.172868 0.082768
C  2.920014 -0.894798 -0.340181
C  2.63704 0.573838 -0.710242
C  5.159872 0.280586 -0.691297
C  4.037491 0.542603 1.535899
C  2.057665 -1.649871 0.595831
C  1.472566 1.242557 -0.123995
C  1.084966 -2.478488 0.20132
C  0.281605 -3.268714 1.186995
C  0.71684 -2.665002 -1.2430
C  -0.443694 2.526156 -0.703538
C  -1.753936 1.567627 1.185086
C  -1.827687 0.475905 -0.827804
C  -2.512356 0.283046 1.371702
C  -3.101292 -1.550254 -0.269577
C  -4.522999 -1.333464 -0.52977
C  -5.692014 -1.143966 -0.731848
H  3.229989 -1.459351 -1.215254
H  2.810061 0.821037 -1.750718
H  5.910133 -0.392648 -0.272472
H  5.031008 0.021405 -1.742726
H  5.559566 1.295104 -0.642792
H  4.329958 1.589543 1.631558
H  3.155309 0.389109 2.149275
H  4.841311 -0.059804 1.963162
H  2.251325 -1.549048 1.658732
H  -0.790385 -3.116861 1.036895
H  0.455803 -4.340045 1.055944
H  0.52168 -3.010977 2.218263
H  1.587446 -2.703265 -1.899016
H  0.149176 -3.583257 -1.393958
H  0.094253 -1.839785 -1.597577
H  -0.262181 3.325009 0.01425
H  -0.82473 2.960627 -1.623309
H  -2.052419 -0.323531 2.154712
H  -3.547653 0.489864 1.656893
H  -2.979689 -2.261334 0.54935
H  -2.624389 -2.001219 -1.140429
H  -6.730732 -0.97717 -0.911173
elementType: O N C H
totalener: -1071.53520571 hartree
nucrepener: 2063.58076742 hartree
electener: -3135.11597313 hartree
oneelecener: -5559.97493866 hartree
twoeener: 2424.85896553 hartree
cpcmener: -0.05286799 hartree
kineticenergy: 1066.86761263 hartree
xcener: -102.627705293174 hartree
chargesum: 0.0000000
charge: -0.289420 -0.485421 -0.469226 -0.513855 -0.128515 -0.131972 0.134304 -0.048083 -0.093583 -0.262860 -0.290338 -0.249636 0.414772 -0.037482 -0.226329 -0.289694 0.089748 0.310039 0.375994 0.000006 -0.115104 -0.452501 0.128812 0.118919 0.094421 0.095744 0.088024 0.095955 0.103244 0.090122 0.099720 0.130084 0.094417 0.104293 0.089587 0.108717 0.104280 0.093177 0.135431 0.145897 0.127458 0.134323 0.148173 0.139459 0.288897
qa: -0.2894 -0.4854 -0.4692 -0.5139 -0.1285 -0.1320 0.1343 -0.0481 -0.0936 -0.2629 -0.2903 -0.2496 0.4148 -0.0375 -0.2263 -0.2897 0.0897 0.3100 0.3760 0.0000 -0.1151 -0.4525 0.1288 0.1189 0.0944 0.0957 0.0880 0.0960 0.1032 0.0901 0.0997 0.1301 0.0944 0.1043 0.0896 0.1087 0.1043 0.0932 0.1354 0.1459 0.1275 0.1343 0.1482 0.1395 0.2889
va: 2.1048 2.0054 2.0429 1.9958 3.1105 3.1716 3.7849 3.7918 3.8431 3.8943 3.8883 3.7904 4.0779 3.7062 3.9189 3.9376 3.8922 4.1772 4.2940 3.8822 3.9444 3.9298 3.4788 1.0033 1.0310 1.0020 1.0048 1.0025 0.9995 1.0201 0.9995 1.0009 0.9915 0.9957 1.0084 1.0060 1.0017 1.0078 1.0151 0.9933 1.0086 1.0047 0.9793 0.9971 0.9444
dispcorr: -0.025491163 hartree
energy: -1071.560696868718
dipole: 18.91674 -19.15275 -0.23601 -15.98866 14.42811 -1.56054 1.76486 -1.94356 -0.17870
magnitude: 1.58838 au
magnitude: 4.03733 debye
