program: Orca
programVersion: 5.0.2
elementType: O O O O N N C C C C C C C C C C C C C C C C C H H H H H H H H H H H H H H H H H H H H H H
charge: 0
multiplicity: 1
keywords: wb97x-d3
keywords: def2-TZVPP
keywords: def2/J RIJCOSX
keywords: DEFGRID2
keywords: scfconv7
keywords: smallprint printgap noloewdin
keywords: NOSOSCF
formula: C17H22N2O4
InChI: InChI=1/C17H22N2O4/c1-6-7-18-9-13(20)19(16(18)22)10-23-15(21)14-12(8-11(2)3)17(14,4)5/h1,8,12,14H,7,9-10H2,2-5H3
45 atoms
O  0.830156 1.699653 -1.099756
O  0.12653 -0.37358 -0.635915
O  -0.670568 3.42744 0.892957
O  -2.679459 0.218692 -1.63802
N  -1.482828 1.94809 -0.662832
N  -3.198453 1.069444 0.43591
C  2.61263 -0.232448 1.326618
C  3.026129 -1.041334 0.147426
C  2.36208 0.310136 -0.076689
C  3.687085 0.488598 2.103567
C  1.458721 -0.683634 2.186823
C  2.39707 -2.349358 -0.168934
C  1.005496 0.454206 -0.617115
C  2.157771 -2.829919 -1.39093
C  1.563955 -4.191401 -1.585928
C  2.427301 -2.065545 -2.649172
C  -0.43276 2.056701 -1.634743
C  -1.452641 2.570644 0.557853
C  -2.48181 0.971974 -0.712246
C  -2.552052 1.956418 1.375611
C  -3.968565 -0.063914 0.903939
C  -3.105992 -1.121851 1.427154
C  -2.359715 -1.965911 1.84458
H  4.088308 -0.993768 -0.081884
H  3.031417 1.108481 -0.374387
H  4.507993 0.807428 1.460369
H  3.285974 1.374181 2.599736
H  4.102346 -0.164029 2.873961
H  1.834344 -1.310423 2.99777
H  0.9598 0.174266 2.641582
H  0.707094 -1.261431 1.653971
H  2.158903 -2.978825 0.684283
H  0.604428 -4.127503 -2.105736
H  2.209918 -4.817197 -2.206667
H  1.400208 -4.707944 -0.640368
H  1.501501 -1.911566 -3.209744
H  2.880221 -1.091594 -2.472971
H  3.093193 -2.629104 -3.307482
H  -0.321659 3.088844 -1.955458
H  -0.692125 1.446395 -2.498648
H  -2.112855 1.417934 2.221359
H  -3.231196 2.715172 1.766361
H  -4.586764 -0.443548 0.090947
H  -4.654556 0.281361 1.677709
H  -1.704878 -2.720906 2.219481
elementType: O N C H
totalener: -1071.53514611 hartree
nucrepener: 2062.76287459 hartree
electener: -3134.29802071 hartree
oneelecener: -5559.36102774 hartree
twoeener: 2425.06300703 hartree
cpcmener: -0.05539867 hartree
kineticenergy: 1066.87762742 hartree
xcener: -102.627090700449 hartree
chargesum: 0.0000000
charge: -0.290064 -0.481242 -0.472703 -0.498683 -0.118604 -0.158590 0.141153 -0.007135 -0.126206 -0.266878 -0.285269 -0.284339 0.427407 -0.024083 -0.224790 -0.269248 0.082127 0.307878 0.381467 -0.008582 -0.020588 -0.407970 0.008632 0.118747 0.099059 0.088827 0.095715 0.095063 0.105921 0.103115 0.071103 0.126053 0.094818 0.095917 0.089306 0.099102 0.095635 0.108609 0.148764 0.137843 0.129043 0.127388 0.135781 0.141539 0.288963
qa: -0.2901 -0.4812 -0.4727 -0.4987 -0.1186 -0.1586 0.1412 -0.0071 -0.1262 -0.2669 -0.2853 -0.2843 0.4274 -0.0241 -0.2248 -0.2692 0.0821 0.3079 0.3815 -0.0086 -0.0206 -0.4080 0.0086 0.1187 0.0991 0.0888 0.0957 0.0951 0.1059 0.1031 0.0711 0.1261 0.0948 0.0959 0.0893 0.0991 0.0956 0.1086 0.1488 0.1378 0.1290 0.1274 0.1358 0.1415 0.2890
va: 2.1039 2.0049 2.0357 2.0144 3.1002 3.1694 3.7285 3.8321 3.8252 3.9033 3.9175 3.8454 4.0496 3.6954 3.9238 3.9458 3.8954 4.1720 4.3249 3.9261 3.9067 3.7142 3.6430 1.0032 1.0309 1.0050 1.0019 1.0017 1.0011 1.0023 1.0053 1.0004 0.9967 0.9967 1.0070 0.9990 1.0040 0.9996 0.9908 1.0138 1.0007 1.0098 1.0015 0.9881 0.9459
dispcorr: -0.024812064 hartree
energy: -1071.559958175386
dipole: 18.37110 -18.36116 0.00994 -16.40000 16.64944 0.24944 3.89737 -2.71319 1.18418
magnitude: 1.21021 au
magnitude: 3.07610 debye
